program: Orca
programVersion: 5.0.2
elementType: Cl Cl F O O O N C C C C C C C C C C C C C C C C C C C C C C H H H H H H H H H H H H H H H H H H
charge: 0
multiplicity: 1
keywords: wb97x-d3
keywords: def2-TZVPP
keywords: def2/J RIJCOSX
keywords: DEFGRID2
keywords: scfconv7
keywords: smallprint printgap noloewdin
keywords: NOSOSCF
formula: C22H18Cl2FNO3
InChI: InChI=1/C22H18Cl2FNO3/c1-22(2)15(11-19(23)24)20(22)21(27)29-18(12-26)13-8-9-16(25)17(10-13)28-14-6-4-3-5-7-14/h3-11,15,18,20H,1-2H3
47 atoms
Cl -5.180805 2.792039 1.002421
Cl -5.279521 5.324511 -0.377047
F  3.459404 -3.664043 -1.263879
O  1.116966 2.092075 -0.163108
O  -0.43622 0.817126 0.812679
O  3.145183 -3.245438 1.438949
N  4.24769 2.944052 0.408056
C  -1.959666 1.60127 -1.855526
C  -2.549275 2.308908 -0.668647
C  -1.054879 2.369804 -0.909871
C  -2.120449 2.185391 -3.237982
C  -1.96414 0.092622 -1.84946
C  -3.328543 3.544991 -0.810542
C  -0.145449 1.665556 0.010594
C  -4.441453 3.83636 -0.149192
C  2.11931 1.441083 0.603837
C  2.435223 0.055957 0.089692
C  3.300881 2.299271 0.488068
C  2.572073 -0.993328 0.986638
C  2.611219 -0.160457 -1.271032
C  2.918722 -2.2565 0.53457
C  2.93951 -1.42437 -1.733039
C  3.105437 -2.451789 -0.828486
C  2.467615 -4.43486 1.352555
C  3.089501 -5.534247 1.928985
C  1.213259 -4.551683 0.770018
C  2.451316 -6.764807 1.912593
C  0.590961 -5.793623 0.755535
C  1.202471 -6.903197 1.320552
H  -2.850806 1.653523 0.140536
H  -0.660886 3.298106 -1.308259
H  -3.099481 1.929279 -3.646622
H  -2.020792 3.269605 -3.26297
H  -1.364571 1.77439 -3.908921
H  -1.980674 -0.336973 -0.850714
H  -2.849679 -0.269948 -2.372475
H  -1.090896 -0.300213 -2.372857
H  -2.968376 4.293177 -1.506693
H  1.845296 1.400848 1.663207
H  2.42678 -0.836071 2.048757
H  2.504619 0.649243 -1.981259
H  3.088634 -1.609821 -2.788632
H  4.066164 -5.423989 2.384171
H  0.712633 -3.694331 0.336824
H  2.940075 -7.621075 2.359405
H  -0.385774 -5.887032 0.29865
H  0.709702 -7.866715 1.302325
elementType: Cl F O N C H
totalener: -2149.93923828 hartree
nucrepener: 2863.64666226 hartree
electener: -5013.58590055 hartree
oneelecener: -8640.28780942 hartree
twoeener: 3626.70190887 hartree
cpcmener: -0.03329120 hartree
kineticenergy: 2143.46023606 hartree
xcener: -159.158149827406 hartree
chargesum: -0.0000000
charge: -0.054838 -0.059503 -0.206950 -0.279165 -0.434932 -0.321124 -0.086010 0.088428 0.029847 -0.070330 -0.264328 -0.262672 -0.201928 0.369539 0.039927 0.410677 -0.001453 -0.229181 -0.183650 -0.188512 0.151644 -0.168319 0.275575 0.280211 -0.248551 -0.178448 -0.119500 -0.154386 -0.185197 0.080220 0.098926 0.102467 0.090922 0.098790 0.095201 0.100421 0.097346 0.130012 0.141832 0.140153 0.150865 0.152477 0.145241 0.156026 0.156216 0.158761 0.157254
qa: -0.0548 -0.0595 -0.2070 -0.2792 -0.4349 -0.3211 -0.0860 0.0884 0.0298 -0.0703 -0.2643 -0.2627 -0.2019 0.3695 0.0399 0.4107 -0.0015 -0.2292 -0.1836 -0.1885 0.1516 -0.1683 0.2756 0.2802 -0.2486 -0.1784 -0.1195 -0.1544 -0.1852 0.0802 0.0989 0.1025 0.0909 0.0988 0.0952 0.1004 0.0973 0.1300 0.1418 0.1402 0.1509 0.1525 0.1452 0.1560 0.1562 0.1588 0.1573
va: 1.2707 1.2452 1.0837 2.1261 2.0781 2.0770 3.1123 3.7412 3.8794 3.8313 3.9060 3.9058 3.8942 4.2268 4.2144 3.7106 3.6195 4.0864 4.0267 3.9258 3.7818 3.9230 3.9710 3.6820 3.9971 3.8816 3.8943 3.9068 3.9036 1.0480 1.0322 1.0009 1.0056 1.0014 1.0166 1.0013 1.0003 1.0182 1.0178 1.0142 1.0099 0.9980 1.0088 1.0014 0.9894 0.9908 0.9904
dispcorr: -0.023812683 hartree
energy: -2149.963050967524
dipole: 9.99069 -10.95281 -0.96212 -22.09283 21.48781 -0.60502 -12.05246 10.57999 -1.47247
magnitude: 1.86008 au
magnitude: 4.72794 debye
