program: Orca
programVersion: 5.0.2
elementType: Cl Cl F O O O N C C C C C C C C C C C C C C C C C C C C C C H H H H H H H H H H H H H H H H H H
charge: 0
multiplicity: 1
keywords: wb97x-d3
keywords: def2-TZVPP
keywords: def2/J RIJCOSX
keywords: DEFGRID2
keywords: scfconv7
keywords: smallprint printgap noloewdin
keywords: NOSOSCF
formula: C22H18Cl2FNO3
InChI: InChI=1/C22H18Cl2FNO3/c1-22(2)15(11-19(23)24)20(22)21(27)29-18(12-26)13-8-9-16(25)17(10-13)28-14-6-4-3-5-7-14/h3-11,15,18,20H,1-2H3
47 atoms
Cl -5.121877 2.835983 1.179756
Cl -5.206489 5.411727 -0.118122
F  3.262185 -3.691807 -1.496486
O  1.183349 2.091694 -0.098416
O  -0.37352 0.836245 0.897443
O  3.102897 -3.360315 1.224926
N  4.351367 2.843007 0.387493
C  -1.926865 1.717551 -1.727938
C  -2.492725 2.391655 -0.509599
C  -1.002052 2.445011 -0.769059
C  -2.099409 2.350077 -3.087546
C  -1.948419 0.209671 -1.771128
C  -3.262764 3.63837 -0.60489
C  -0.084776 1.696865 0.108019
C  -4.372965 3.915198 0.066848
C  2.193409 1.386302 0.608174
C  2.447835 0.012616 0.03189
C  3.393402 2.216457 0.478469
C  2.587982 -1.073456 0.883977
C  2.5582 -0.158477 -1.342038
C  2.869125 -2.329104 0.370995
C  2.817911 -1.415423 -1.864186
C  2.983126 -2.481207 -1.005561
C  2.382616 -4.522308 1.11929
C  1.099038 -4.57119 0.594468
C  2.994818 -5.66724 1.610822
C  0.435842 -5.79059 0.551129
C  2.316292 -6.874885 1.566684
C  1.036762 -6.945145 1.030853
H  -2.791554 1.712886 0.281085
H  -0.602537 3.381232 -1.142623
H  -1.982192 3.432788 -3.076202
H  -1.359757 1.95117 -3.783707
H  -3.088632 2.124121 -3.489993
H  -1.954925 -0.252087 -0.785997
H  -2.846645 -0.126019 -2.29203
H  -1.086846 -0.175815 -2.320057
H  -2.899093 4.407407 -1.275868
H  1.956465 1.313962 1.674843
H  2.494593 -0.951203 1.956515
H  2.451797 0.680409 -2.017673
H  2.912957 -1.56504 -2.931722
H  0.606883 -3.678941 0.227089
H  3.995351 -5.609576 2.021171
H  -0.563849 -5.83083 0.138193
H  2.797644 -7.766771 1.946823
H  0.512546 -7.890701 0.989861
elementType: Cl F O N C H
totalener: -2149.93910424 hartree
nucrepener: 2866.64047675 hartree
electener: -5016.57958099 hartree
oneelecener: -8646.25353596 hartree
twoeener: 3629.67395497 hartree
cpcmener: -0.03330637 hartree
kineticenergy: 2143.46235932 hartree
xcener: -159.158362166375 hartree
chargesum: 0.0000000
charge: -0.054947 -0.059546 -0.206926 -0.278386 -0.433643 -0.321294 -0.085875 0.090101 0.029934 -0.070626 -0.264439 -0.263108 -0.202231 0.366404 0.039826 0.408529 0.003445 -0.228782 -0.187102 -0.192429 0.152651 -0.167227 0.276796 0.278495 -0.176809 -0.248503 -0.155173 -0.119738 -0.185075 0.080051 0.099269 0.090910 0.098608 0.102723 0.095271 0.101055 0.097014 0.129988 0.142479 0.140461 0.150767 0.152729 0.156349 0.145344 0.158578 0.156782 0.157300
qa: -0.0549 -0.0595 -0.2069 -0.2784 -0.4336 -0.3213 -0.0859 0.0901 0.0299 -0.0706 -0.2644 -0.2631 -0.2022 0.3664 0.0398 0.4085 0.0034 -0.2288 -0.1871 -0.1924 0.1527 -0.1672 0.2768 0.2785 -0.1768 -0.2485 -0.1552 -0.1197 -0.1851 0.0801 0.0993 0.0909 0.0986 0.1027 0.0953 0.1011 0.0970 0.1300 0.1425 0.1405 0.1508 0.1527 0.1563 0.1453 0.1586 0.1568 0.1573
va: 1.2705 1.2453 1.0837 2.1250 2.0790 2.0771 3.1124 3.7403 3.8804 3.8291 3.9056 3.9056 3.8929 4.2338 4.2143 3.7113 3.6145 4.0855 4.0284 3.9250 3.7811 3.9226 3.9682 3.6825 3.8794 3.9986 3.9075 3.8942 3.9039 1.0478 1.0321 1.0056 1.0014 1.0009 1.0162 1.0013 1.0003 1.0182 1.0174 1.0140 1.0100 0.9979 1.0010 1.0088 0.9908 0.9892 0.9904
dispcorr: -0.023932830 hartree
energy: -2149.963037069515
dipole: 9.65054 -10.63575 -0.98522 -21.62096 21.09213 -0.52883 -12.69283 11.24322 -1.44962
magnitude: 1.83077 au
magnitude: 4.65344 debye
