program: Orca
programVersion: 5.0.2
elementType: Cl Cl F O O O N C C C C C C C C C C C C C C C C C C C C C C H H H H H H H H H H H H H H H H H H
charge: 0
multiplicity: 1
keywords: wb97x-d3
keywords: def2-TZVPP
keywords: def2/J RIJCOSX
keywords: DEFGRID2
keywords: scfconv7
keywords: smallprint printgap noloewdin
keywords: NOSOSCF
formula: C22H18Cl2FNO3
InChI: InChI=1/C22H18Cl2FNO3/c1-22(2)15(11-19(23)24)20(22)21(27)29-18(12-26)13-8-9-16(25)17(10-13)28-14-6-4-3-5-7-14/h3-11,15,18,20H,1-2H3
47 atoms
Cl -5.563074 2.21063 -0.789248
Cl -5.505705 5.082056 -0.51574
F  4.357658 -2.670598 -1.91211
O  0.626098 1.640985 0.782912
O  -0.912555 0.195799 0.054373
O  2.698959 -3.834148 -0.229592
N  2.896007 1.706041 3.177025
C  -1.284307 2.489737 -2.096101
C  -2.435335 2.469888 -1.131736
C  -1.016034 2.501267 -0.602666
C  -0.941266 3.758977 -2.836886
C  -1.029324 1.245805 -2.910573
C  -3.282553 3.648932 -0.915742
C  -0.475699 1.316577 0.085115
C  -4.600203 3.637105 -0.760631
C  1.286356 0.577523 1.455102
C  2.095772 -0.289736 0.519225
C  2.174752 1.229334 2.421093
C  1.982423 -1.670145 0.605075
C  2.957676 0.291985 -0.40161
C  2.75941 -2.48113 -0.210112
C  3.716299 -0.512751 -1.236392
C  3.61828 -1.88301 -1.124732
C  2.414135 -4.545083 0.908259
C  2.980458 -4.235993 2.138059
C  1.577252 -5.641258 0.763922
C  2.687065 -5.03498 3.233899
C  1.304641 -6.438632 1.86599
C  1.851597 -6.136384 3.105184
H  -2.931408 1.5099 -1.043557
H  -0.664863 3.448685 -0.209484
H  0.088076 3.71596 -3.196974
H  -1.591145 3.881452 -3.705349
H  -1.031525 4.653741 -2.222301
H  0.035092 1.133748 -3.125755
H  -1.374306 0.333623 -2.428839
H  -1.551232 1.32521 -3.865912
H  -2.799233 4.617692 -0.873825
H  0.576693 -0.034474 2.021257
H  1.289968 -2.111741 1.311487
H  3.0508 1.368029 -0.474353
H  4.393812 -0.07967 -1.960767
H  3.645995 -3.3889 2.248644
H  1.149254 -5.869992 -0.204061
H  3.125044 -4.795038 4.194137
H  0.654977 -7.296838 1.752282
H  1.632239 -6.757002 3.963895
elementType: Cl F O N C H
totalener: -2149.93913944 hartree
nucrepener: 2853.52236962 hartree
electener: -5003.46150906 hartree
oneelecener: -8620.10591004 hartree
twoeener: 3616.64440099 hartree
cpcmener: -0.03276210 hartree
kineticenergy: 2143.46192431 hartree
xcener: -159.159895957138 hartree
chargesum: -0.0000000
charge: -0.054478 -0.059684 -0.207767 -0.279316 -0.436743 -0.320516 -0.087215 0.088461 0.034250 -0.077030 -0.264358 -0.262620 -0.203695 0.378355 0.039845 0.405971 -0.004207 -0.225364 -0.171353 -0.208659 0.211006 -0.163201 0.203666 0.292109 -0.202514 -0.250634 -0.140274 -0.116893 -0.183809 0.079638 0.098762 0.098420 0.102313 0.090998 0.097681 0.095563 0.099404 0.129459 0.138953 0.150235 0.149211 0.151934 0.159901 0.147210 0.160350 0.158121 0.158513
qa: -0.0545 -0.0597 -0.2078 -0.2793 -0.4367 -0.3205 -0.0872 0.0885 0.0343 -0.0770 -0.2644 -0.2626 -0.2037 0.3784 0.0398 0.4060 -0.0042 -0.2254 -0.1714 -0.2087 0.2110 -0.1632 0.2037 0.2921 -0.2025 -0.2506 -0.1403 -0.1169 -0.1838 0.0796 0.0988 0.0984 0.1023 0.0910 0.0977 0.0956 0.0994 0.1295 0.1390 0.1502 0.1492 0.1519 0.1599 0.1472 0.1604 0.1581 0.1585
va: 1.2710 1.2451 1.0846 2.1280 2.0787 2.0894 3.1116 3.7427 3.8758 3.8364 3.9062 3.9051 3.8953 4.2182 4.2130 3.7274 3.6445 4.0777 3.9469 3.9319 3.7203 3.8933 4.0601 3.6884 3.9227 4.0119 3.8873 3.8809 3.9100 1.0481 1.0322 1.0014 1.0009 1.0057 1.0007 1.0174 1.0007 1.0188 1.0195 1.0049 1.0102 0.9976 0.9951 1.0075 0.9898 0.9891 0.9903
dispcorr: -0.023448118 hartree
energy: -2149.962587558690
dipole: 18.16709 -18.24312 -0.07602 -11.61890 11.89842 0.27953 -3.73314 2.90843 -0.82471
magnitude: 0.87411 au
magnitude: 2.22181 debye
