program: Orca
programVersion: 5.0.2
elementType: Cl Cl F O O O N C C C C C C C C C C C C C C C C C C C C C C H H H H H H H H H H H H H H H H H H
charge: 0
multiplicity: 1
keywords: wb97x-d3
keywords: def2-TZVPP
keywords: def2/J RIJCOSX
keywords: DEFGRID2
keywords: scfconv7
keywords: smallprint printgap noloewdin
keywords: NOSOSCF
formula: C22H18Cl2FNO3
InChI: InChI=1/C22H18Cl2FNO3/c1-22(2)15(11-19(23)24)20(22)21(27)29-18(12-26)13-8-9-16(25)17(10-13)28-14-6-4-3-5-7-14/h3-11,15,18,20H,1-2H3
47 atoms
Cl -4.065278 4.148076 1.112117
Cl -5.688555 3.512265 -1.185888
F  5.113662 -2.932444 1.437143
O  1.041141 1.031994 -1.303054
O  0.646158 2.060174 0.646517
O  2.492904 -3.065447 1.271597
N  3.33785 1.454249 -3.618474
C  -1.963186 0.254871 0.386287
C  -2.294886 1.704854 0.174492
C  -1.156721 1.078114 -0.602906
C  -2.842225 -0.819455 -0.20681
C  -1.370298 -0.142282 1.714642
C  -3.492575 2.116041 -0.56876
C  0.234141 1.46844 -0.315059
C  -4.295734 3.122764 -0.250391
C  2.431297 1.245193 -1.175303
C  3.138768 0.108333 -0.458635
C  2.925594 1.364566 -2.550399
C  2.427045 -0.969509 0.048121
C  4.518456 0.166335 -0.315529
C  3.096581 -1.999263 0.69459
C  5.192185 -0.861583 0.324707
C  4.478865 -1.931945 0.816645
C  1.254003 -3.491437 0.866005
C  0.345004 -3.80676 1.864586
C  0.934746 -3.672225 -0.473721
C  -0.899592 -4.312882 1.517404
C  -0.319545 -4.163194 -0.806013
C  -1.239186 -4.487084 0.183115
H  -1.991609 2.361166 0.982414
H  -1.349247 0.850786 -1.645438
H  -3.194238 -0.584982 -1.210648
H  -2.290895 -1.759387 -0.268553
H  -3.716488 -0.989626 0.424279
H  -2.172119 -0.417531 2.4023
H  -0.722436 -1.014519 1.603435
H  -0.794711 0.649749 2.188999
H  -3.752162 1.554398 -1.458365
H  2.644708 2.19335 -0.668825
H  1.352149 -1.028515 -0.054667
H  5.080026 1.007628 -0.703061
H  6.268281 -0.833105 0.436101
H  0.614615 -3.664704 2.903711
H  1.649654 -3.439764 -1.253239
H  -1.606224 -4.565223 2.297312
H  -0.573352 -4.301266 -1.849093
H  -2.212839 -4.875251 -0.085474
elementType: Cl F O N C H
totalener: -2149.93709986 hartree
nucrepener: 2975.50764681 hartree
electener: -5125.44474667 hartree
oneelecener: -8863.36667772 hartree
twoeener: 3737.92193105 hartree
cpcmener: -0.03196670 hartree
kineticenergy: 2143.44760151 hartree
xcener: -159.161445741217 hartree
chargesum: -0.0000000
charge: -0.054224 -0.059010 -0.209561 -0.281243 -0.425747 -0.317959 -0.087094 0.112176 0.028676 -0.071960 -0.260345 -0.251572 -0.203274 0.357127 0.037015 0.393968 0.008266 -0.225491 -0.188594 -0.232814 0.268937 -0.143043 0.176087 0.295892 -0.246430 -0.209813 -0.115214 -0.124410 -0.190130 0.080631 0.097770 0.095190 0.077127 0.104886 0.106055 0.065395 0.102255 0.128999 0.143261 0.136127 0.150365 0.150959 0.145534 0.159799 0.157485 0.159881 0.158062
qa: -0.0542 -0.0590 -0.2096 -0.2812 -0.4257 -0.3180 -0.0871 0.1122 0.0287 -0.0720 -0.2603 -0.2516 -0.2033 0.3571 0.0370 0.3940 0.0083 -0.2255 -0.1886 -0.2328 0.2689 -0.1430 0.1761 0.2959 -0.2464 -0.2098 -0.1152 -0.1244 -0.1901 0.0806 0.0978 0.0952 0.0771 0.1049 0.1061 0.0654 0.1023 0.1290 0.1433 0.1361 0.1504 0.1510 0.1455 0.1598 0.1575 0.1599 0.1581
va: 1.2719 1.2457 1.0814 2.1075 2.0825 2.0993 3.1120 3.6957 3.9036 3.8406 3.9067 3.8928 3.8984 4.2167 4.2161 3.7076 3.7385 4.0417 3.9363 3.9705 3.6449 3.8796 4.0580 3.6560 3.9630 3.9113 3.8357 3.8244 3.8635 1.0477 1.0341 1.0089 1.0130 1.0015 1.0020 1.0120 1.0212 1.0196 1.0203 1.0035 1.0008 0.9978 1.0087 0.9939 0.9891 0.9896 0.9917
dispcorr: -0.027176145 hartree
energy: -2149.964276004076
dipole: 2.34577 -3.37409 -1.02831 -25.28189 24.13539 -1.14650 2.59916 -2.20714 0.39203
magnitude: 1.58920 au
magnitude: 4.03943 debye
