program: Orca
programVersion: 5.0.2
elementType: Cl Cl F O O O N C C C C C C C C C C C C C C C C C C C C C C H H H H H H H H H H H H H H H H H H
charge: 0
multiplicity: 1
keywords: wb97x-d3
keywords: def2-TZVPP
keywords: def2/J RIJCOSX
keywords: DEFGRID2
keywords: scfconv7
keywords: smallprint printgap noloewdin
keywords: NOSOSCF
formula: C22H18Cl2FNO3
InChI: InChI=1/C22H18Cl2FNO3/c1-22(2)15(11-19(23)24)20(22)21(27)29-18(12-26)13-8-9-16(25)17(10-13)28-14-6-4-3-5-7-14/h3-11,15,18,20H,1-2H3
47 atoms
Cl -3.763097 5.065568 -2.043313
Cl -6.076092 3.528717 -1.264756
F  4.871247 -2.130376 2.569974
O  0.232291 0.457582 -0.628896
O  0.566928 2.638326 -1.031409
O  2.692769 -3.464664 1.911454
N  0.885082 -1.571853 -3.175097
C  -1.548966 2.948798 1.267627
C  -2.194538 3.172343 -0.068384
C  -1.374347 1.916201 0.169238
C  -2.388931 2.517262 2.446077
C  -0.407595 3.852996 1.66425
C  -3.640216 3.029168 -0.276062
C  -0.102896 1.758681 -0.556839
C  -4.381095 3.776639 -1.084683
C  1.461476 0.104925 -1.255137
C  2.394659 -0.508749 -0.245365
C  1.13107 -0.834748 -2.329367
C  2.076694 -1.730986 0.338467
C  3.544657 0.169584 0.127571
C  2.924594 -2.28881 1.279297
C  4.386895 -0.372222 1.089008
C  4.070887 -1.58979 1.647366
C  2.068742 -4.491659 1.24759
C  1.14288 -5.231759 1.966473
C  2.381359 -4.821315 -0.065059
C  0.517026 -6.31175 1.359924
C  1.736462 -5.894451 -0.662341
C  0.803253 -6.642346 0.043052
H  -1.703598 3.916139 -0.685364
H  -1.92794 0.995755 0.315354
H  -3.140437 1.771489 2.190356
H  -1.75398 2.084506 3.221136
H  -2.903397 3.376135 2.881312
H  0.321871 3.312809 2.270813
H  0.114134 4.291462 0.817006
H  -0.791311 4.675665 2.27008
H  -4.154975 2.243414 0.263877
H  1.934496 0.975948 -1.716198
H  1.171237 -2.255053 0.054737
H  3.790403 1.121476 -0.324701
H  5.287936 0.143956 1.393837
H  0.917877 -4.965861 2.991716
H  3.116164 -4.254646 -0.623301
H  -0.20479 -6.890233 1.921729
H  1.972723 -6.147662 -1.687774
H  0.305356 -7.478257 -0.430188
elementType: Cl F O N C H
totalener: -2149.93891317 hartree
nucrepener: 2843.08158595 hartree
electener: -4993.02049912 hartree
oneelecener: -8599.23234216 hartree
twoeener: 3606.21184304 hartree
cpcmener: -0.03145616 hartree
kineticenergy: 2143.46531467 hartree
xcener: -159.159919536672 hartree
chargesum: -0.0000000
charge: -0.054568 -0.059332 -0.206490 -0.284236 -0.443136 -0.322631 -0.088389 0.086413 0.031493 -0.092814 -0.266424 -0.269445 -0.201982 0.406251 0.043210 0.425006 0.004323 -0.230340 -0.205066 -0.160240 0.196335 -0.158233 0.192695 0.284969 -0.244472 -0.193772 -0.119917 -0.139521 -0.182208 0.080997 0.097853 0.091137 0.098827 0.102245 0.101171 0.095332 0.099085 0.128168 0.125623 0.150539 0.150615 0.152185 0.146909 0.156779 0.157889 0.159377 0.157795
qa: -0.0546 -0.0593 -0.2065 -0.2842 -0.4431 -0.3226 -0.0884 0.0864 0.0315 -0.0928 -0.2664 -0.2694 -0.2020 0.4063 0.0432 0.4250 0.0043 -0.2303 -0.2051 -0.1602 0.1963 -0.1582 0.1927 0.2850 -0.2445 -0.1938 -0.1199 -0.1395 -0.1822 0.0810 0.0979 0.0911 0.0988 0.1022 0.1012 0.0953 0.0991 0.1282 0.1256 0.1505 0.1506 0.1522 0.1469 0.1568 0.1579 0.1594 0.1578
va: 1.2710 1.2455 1.0868 2.1364 2.0729 2.0887 3.1073 3.7345 3.8641 3.8398 3.9115 3.9091 3.9023 4.1948 4.2146 3.6997 3.7231 4.0839 3.9685 3.8881 3.7442 3.8839 4.0687 3.6926 4.0076 3.9095 3.8826 3.8887 3.9077 1.0478 1.0319 1.0059 1.0013 1.0003 0.9988 1.0176 1.0002 1.0197 1.0370 1.0099 0.9999 0.9978 1.0070 0.9960 0.9891 0.9901 0.9904
dispcorr: -0.022849125 hartree
energy: -2149.961762292815
dipole: 11.27067 -11.15258 0.11808 -13.18409 13.35570 0.17160 16.12241 -14.37029 1.75211
magnitude: 1.76445 au
magnitude: 4.48488 debye
