program: Orca
programVersion: 5.0.2
elementType: Cl Cl F O O O N C C C C C C C C C C C C C C C C C C C C C C H H H H H H H H H H H H H H H H H H
charge: 0
multiplicity: 1
keywords: wb97x-d3
keywords: def2-TZVPP
keywords: def2/J RIJCOSX
keywords: DEFGRID2
keywords: scfconv7
keywords: smallprint printgap noloewdin
keywords: NOSOSCF
formula: C22H18Cl2FNO3
InChI: InChI=1/C22H18Cl2FNO3/c1-22(2)15(11-19(23)24)20(22)21(27)29-18(12-26)13-8-9-16(25)17(10-13)28-14-6-4-3-5-7-14/h3-11,15,18,20H,1-2H3
47 atoms
Cl -5.093611 2.465315 0.946094
Cl -5.21544 4.820408 -0.712985
F  4.64719 -3.241711 -1.676502
O  1.170886 1.66093 -0.120981
O  -0.396179 0.480621 0.962586
O  2.538236 -3.658963 -0.163947
N  3.761995 3.19225 1.223577
C  -1.889283 0.951069 -1.777542
C  -2.487221 1.790418 -0.685712
C  -0.99116 1.827973 -0.923359
C  -2.032157 1.370099 -3.220285
C  -1.896689 -0.546404 -1.589858
C  -3.266549 3.002172 -0.966002
C  -0.089031 1.240524 0.08083
C  -4.36985 3.370353 -0.327073
C  2.19011 1.162116 0.745699
C  2.902641 -0.005943 0.110361
C  3.07751 2.298723 0.996546
C  2.385475 -1.282495 0.326159
C  4.000743 0.173661 -0.715991
C  2.974297 -2.381896 -0.275384
C  4.594793 -0.923814 -1.323323
C  4.081537 -2.178719 -1.097531
C  1.692231 -4.026526 0.855186
C  0.514899 -4.670858 0.507998
C  2.031057 -3.824943 2.186576
C  -0.333541 -5.123296 1.5096
C  1.166263 -4.26844 3.17646
C  -0.015699 -4.918122 2.84463
H  -2.791768 1.231247 0.19176
H  -0.599569 2.704552 -1.426821
H  -1.925863 2.444198 -3.366732
H  -1.267641 0.883016 -3.827883
H  -3.006429 1.072062 -3.611838
H  -1.902469 -0.850096 -0.545439
H  -2.790161 -0.967035 -2.054242
H  -1.02948 -1.003353 -2.070632
H  -2.915653 3.662053 -1.750744
H  1.770345 0.86691 1.711764
H  1.522065 -1.411572 0.965605
H  4.413718 1.157839 -0.896246
H  5.457044 -0.802881 -1.965916
H  0.269278 -4.825562 -0.535283
H  2.957799 -3.331685 2.453374
H  -1.248985 -5.63428 1.239999
H  1.425539 -4.110045 4.215266
H  -0.681491 -5.266649 3.623214
elementType: Cl F O N C H
totalener: -2149.93859495 hartree
nucrepener: 2900.89580627 hartree
electener: -5050.83440122 hartree
oneelecener: -8714.79260929 hartree
twoeener: 3663.95820808 hartree
cpcmener: -0.03017104 hartree
kineticenergy: 2143.45236558 hartree
xcener: -159.158064151306 hartree
chargesum: 0.0000000
charge: -0.055289 -0.059027 -0.207620 -0.272061 -0.444782 -0.317832 -0.086806 0.092217 0.029049 -0.094290 -0.263037 -0.267737 -0.203241 0.412018 0.041145 0.388272 -0.050429 -0.219310 -0.163212 -0.187647 0.229657 -0.153609 0.188962 0.278774 -0.233965 -0.203042 -0.125332 -0.136558 -0.174080 0.080405 0.098580 0.090481 0.099084 0.101672 0.094683 0.099705 0.099414 0.130645 0.137104 0.149376 0.141250 0.151707 0.147043 0.159637 0.159017 0.159683 0.159326
qa: -0.0553 -0.0590 -0.2076 -0.2721 -0.4448 -0.3178 -0.0868 0.0922 0.0290 -0.0943 -0.2630 -0.2677 -0.2032 0.4120 0.0411 0.3883 -0.0504 -0.2193 -0.1632 -0.1876 0.2297 -0.1536 0.1890 0.2788 -0.2340 -0.2030 -0.1253 -0.1366 -0.1741 0.0804 0.0986 0.0905 0.0991 0.1017 0.0947 0.0997 0.0994 0.1306 0.1371 0.1494 0.1412 0.1517 0.1470 0.1596 0.1590 0.1597 0.1593
va: 1.2701 1.2458 1.0840 2.1222 2.0695 2.0909 3.1106 3.7357 3.8673 3.8531 3.9054 3.9091 3.8982 4.1844 4.2143 3.7451 3.8017 4.0641 3.8631 3.9547 3.7223 3.9035 4.0648 3.6832 4.0109 3.9375 3.8823 3.8836 3.9044 1.0481 1.0326 1.0058 1.0014 1.0009 1.0172 1.0013 0.9996 1.0180 1.0211 1.0196 1.0098 0.9985 1.0064 0.9950 0.9889 0.9897 0.9900
dispcorr: -0.023703676 hartree
energy: -2149.962298626120
dipole: 7.48861 -8.07329 -0.58468 -20.05713 19.09538 -0.96174 -5.98021 5.02289 -0.95732
magnitude: 1.47759 au
magnitude: 3.75573 debye
