program: Orca
programVersion: 5.0.2
elementType: Cl Cl F O O O N C C C C C C C C C C C C C C C C C C C C C C H H H H H H H H H H H H H H H H H H
charge: 0
multiplicity: 1
keywords: wb97x-d3
keywords: def2-TZVPP
keywords: def2/J RIJCOSX
keywords: DEFGRID2
keywords: scfconv7
keywords: smallprint printgap noloewdin
keywords: NOSOSCF
formula: C22H18Cl2FNO3
InChI: InChI=1/C22H18Cl2FNO3/c1-22(2)15(11-19(23)24)20(22)21(27)29-18(12-26)13-8-9-16(25)17(10-13)28-14-6-4-3-5-7-14/h3-11,15,18,20H,1-2H3
47 atoms
Cl -5.489312 2.755026 -1.200737
Cl -5.289058 5.411927 -0.093501
F  4.796696 -2.482843 -1.475907
O  0.135541 1.131922 0.825814
O  -1.115215 0.159233 -0.751212
O  3.063683 -4.055172 -0.242473
N  1.327747 0.216054 3.76319
C  -1.046588 3.044586 -2.013597
C  -2.337059 2.859718 -1.273654
C  -1.019041 2.552783 -0.580186
C  -0.491747 4.431199 -2.236016
C  -0.754586 2.105432 -3.15802
C  -3.127759 3.991363 -0.776439
C  -0.705797 1.160131 -0.224784
C  -4.452094 4.035109 -0.703545
C  0.536191 -0.139744 1.297345
C  1.665774 -0.743045 0.492723
C  0.97918 0.083178 2.677034
C  1.796234 -2.124969 0.48215
C  2.585163 0.056733 -0.17082
C  2.867346 -2.716126 -0.169365
C  3.638811 -0.532612 -0.854418
C  3.775058 -1.903425 -0.83776
C  2.756072 -4.84933 0.834136
C  3.065333 -4.478888 2.136906
C  2.165635 -6.073888 0.561833
C  2.757917 -5.34661 3.174712
C  1.8766 -6.936648 1.609626
C  2.16283 -6.575042 2.918768
H  -2.902363 1.983181 -1.569627
H  -0.681429 3.28477 0.144366
H  -0.602088 5.084741 -1.37157
H  0.57412 4.373985 -2.46346
H  -0.986111 4.909616 -3.083428
H  0.316738 1.912586 -3.240593
H  -1.265824 1.149121 -3.074285
H  -1.077922 2.56663 -4.092976
H  -2.593757 4.865928 -0.424102
H  -0.309203 -0.835099 1.336886
H  1.064187 -2.741188 0.991147
H  2.498567 1.134997 -0.166046
H  4.363248 0.073201 -1.383187
H  3.539952 -3.528504 2.348831
H  1.93834 -6.348821 -0.460735
H  2.992798 -5.057756 4.191258
H  1.417156 -7.893635 1.397521
H  1.927762 -7.246657 3.733876
elementType: Cl F O N C H
totalener: -2149.93843692 hartree
nucrepener: 2834.60740053 hartree
electener: -4984.54583745 hartree
oneelecener: -8582.18967657 hartree
twoeener: 3597.64383912 hartree
cpcmener: -0.03303575 hartree
kineticenergy: 2143.46424985 hartree
xcener: -159.160601290224 hartree
chargesum: 0.0000000
charge: -0.054059 -0.059241 -0.208233 -0.287439 -0.437327 -0.324157 -0.086666 0.093411 0.025925 -0.074339 -0.268952 -0.263267 -0.199051 0.383370 0.040544 0.393273 0.016401 -0.223623 -0.186275 -0.185705 0.200291 -0.171783 0.208789 0.275192 -0.186238 -0.242164 -0.142011 -0.121230 -0.182384 0.082652 0.097090 0.092089 0.098452 0.101945 0.098279 0.095605 0.098917 0.129113 0.143045 0.148645 0.148760 0.151041 0.157760 0.147092 0.159637 0.158438 0.158389
qa: -0.0541 -0.0592 -0.2082 -0.2874 -0.4373 -0.3242 -0.0867 0.0934 0.0259 -0.0743 -0.2690 -0.2633 -0.1991 0.3834 0.0405 0.3933 0.0164 -0.2236 -0.1863 -0.1857 0.2003 -0.1718 0.2088 0.2752 -0.1862 -0.2422 -0.1420 -0.1212 -0.1824 0.0827 0.0971 0.0921 0.0985 0.1019 0.0983 0.0956 0.0989 0.1291 0.1430 0.1486 0.1488 0.1510 0.1578 0.1471 0.1596 0.1584 0.1584
va: 1.2717 1.2456 1.0841 2.1142 2.0755 2.0850 3.1139 3.7329 3.8902 3.8344 3.9108 3.9042 3.9004 4.1836 4.2165 3.7349 3.6749 4.0606 3.9668 3.9177 3.7135 3.9026 4.0601 3.6997 3.9080 4.0068 3.8899 3.8849 3.9076 1.0464 1.0334 1.0058 1.0013 1.0005 1.0002 1.0180 1.0004 1.0195 1.0206 1.0034 1.0104 0.9984 0.9963 1.0069 0.9901 0.9890 0.9903
dispcorr: -0.023270606 hartree
energy: -2149.961707523144
dipole: 19.77329 -19.51631 0.25697 -10.30162 11.04538 0.74376 -3.83785 2.94555 -0.89229
magnitude: 1.18971 au
magnitude: 3.02400 debye
