program: Orca
programVersion: 5.0.2
elementType: Cl Cl F O O O N C C C C C C C C C C C C C C C C C C C C C C H H H H H H H H H H H H H H H H H H
charge: 0
multiplicity: 1
keywords: wb97x-d3
keywords: def2-TZVPP
keywords: def2/J RIJCOSX
keywords: DEFGRID2
keywords: scfconv7
keywords: smallprint printgap noloewdin
keywords: NOSOSCF
formula: C22H18Cl2FNO3
InChI: InChI=1/C22H18Cl2FNO3/c1-22(2)15(11-19(23)24)20(22)21(27)29-18(12-26)13-8-9-16(25)17(10-13)28-14-6-4-3-5-7-14/h3-11,15,18,20H,1-2H3
47 atoms
Cl -5.509684 2.133182 -0.377929
Cl -5.405054 5.016066 -0.428557
F  4.204426 -2.737565 -2.015765
O  0.771854 1.726873 0.659212
O  -0.771449 0.171487 0.214293
O  2.532327 -3.749987 -0.269272
N  3.139284 2.17972 2.896611
C  -1.3904 2.177219 -2.153855
C  -2.436956 2.296057 -1.083594
C  -0.969733 2.377026 -0.709729
C  -1.120118 3.338006 -3.079864
C  -1.222342 0.835996 -2.823845
C  -3.251501 3.506353 -0.920435
C  -0.36039 1.294763 0.080225
C  -4.543264 3.536671 -0.619277
C  1.518315 0.77369 1.40614
C  2.281305 -0.168447 0.507331
C  2.426449 1.572992 2.231598
C  2.044639 -1.533828 0.59763
C  3.172539 0.333787 -0.431741
C  2.716288 -2.408452 -0.242496
C  3.828028 -0.533622 -1.291147
C  3.59262 -1.886903 -1.187605
C  2.198613 -4.445349 0.864101
C  2.794273 -4.198327 2.094242
C  1.275306 -5.469294 0.712412
C  2.439789 -4.98287 3.182839
C  0.942114 -6.253847 1.80661
C  1.515574 -6.009974 3.046857
H  -2.921198 1.361381 -0.82367
H  -0.586011 3.36535 -0.483391
H  -0.131015 3.23492 -3.529225
H  -1.851532 3.360591 -3.889852
H  -1.147392 4.303879 -2.577046
H  -0.186239 0.684482 -3.132922
H  -1.512574 -0.002075 -2.194371
H  -1.841451 0.798083 -3.721712
H  -2.760382 4.464618 -1.041097
H  0.871513 0.211133 2.087052
H  1.332287 -1.910347 1.321138
H  3.363098 1.397057 -0.506315
H  4.522208 -0.162395 -2.033784
H  3.527743 -3.410375 2.211803
H  0.829348 -5.653005 -0.257176
H  2.898287 -4.789682 4.144093
H  0.225029 -7.055401 1.685136
H  1.247906 -6.618477 3.900527
elementType: Cl F O N C H
totalener: -2149.93906185 hartree
nucrepener: 2865.31810180 hartree
electener: -5015.25716366 hartree
oneelecener: -8643.73879606 hartree
twoeener: 3628.48163240 hartree
cpcmener: -0.03234876 hartree
kineticenergy: 2143.47167228 hartree
xcener: -159.161587584304 hartree
chargesum: 0.0000000
charge: -0.054689 -0.059335 -0.207215 -0.274672 -0.440358 -0.319972 -0.086885 0.085518 0.032299 -0.078570 -0.262717 -0.264050 -0.199786 0.387405 0.037611 0.399929 -0.012924 -0.225975 -0.164519 -0.207585 0.220990 -0.161193 0.196606 0.298248 -0.208495 -0.252020 -0.139288 -0.116027 -0.185205 0.081787 0.097699 0.098407 0.101782 0.090452 0.099253 0.095139 0.099415 0.128554 0.137257 0.148008 0.148948 0.152147 0.159680 0.147071 0.160350 0.158214 0.158713
qa: -0.0547 -0.0593 -0.2072 -0.2747 -0.4404 -0.3200 -0.0869 0.0855 0.0323 -0.0786 -0.2627 -0.2641 -0.1998 0.3874 0.0376 0.3999 -0.0129 -0.2260 -0.1645 -0.2076 0.2210 -0.1612 0.1966 0.2982 -0.2085 -0.2520 -0.1393 -0.1160 -0.1852 0.0818 0.0977 0.0984 0.1018 0.0905 0.0993 0.0951 0.0994 0.1286 0.1373 0.1480 0.1489 0.1521 0.1597 0.1471 0.1604 0.1582 0.1587
va: 1.2711 1.2455 1.0849 2.1340 2.0763 2.0906 3.1124 3.7434 3.8758 3.8411 3.9064 3.9048 3.8943 4.2041 4.2149 3.7496 3.6434 4.0724 3.9194 3.9475 3.7143 3.8931 4.0688 3.6849 3.9254 4.0126 3.8868 3.8804 3.9114 1.0468 1.0332 1.0015 1.0010 1.0057 0.9998 1.0182 1.0006 1.0191 1.0163 1.0101 1.0079 0.9977 0.9950 1.0078 0.9897 0.9891 0.9903
dispcorr: -0.023431052 hartree
energy: -2149.962492906827
dipole: 16.54177 -16.63888 -0.09711 -13.26789 13.30255 0.03466 -5.26702 4.37892 -0.88810
magnitude: 0.89407 au
magnitude: 2.27254 debye
