program: Orca
programVersion: 5.0.2
elementType: Cl Cl F O O O N C C C C C C C C C C C C C C C C C C C C C C H H H H H H H H H H H H H H H H H H
charge: 0
multiplicity: 1
keywords: wb97x-d3
keywords: def2-TZVPP
keywords: def2/J RIJCOSX
keywords: DEFGRID2
keywords: scfconv7
keywords: smallprint printgap noloewdin
keywords: NOSOSCF
formula: C22H18Cl2FNO3
InChI: InChI=1/C22H18Cl2FNO3/c1-22(2)15(11-19(23)24)20(22)21(27)29-18(12-26)13-8-9-16(25)17(10-13)28-14-6-4-3-5-7-14/h3-11,15,18,20H,1-2H3
47 atoms
Cl -5.191894 2.557435 0.7450
Cl -5.171531 5.030568 -0.738583
F  4.668827 -3.192731 -1.654527
O  1.069146 1.632494 -0.035544
O  -0.594655 0.399472 0.816714
O  2.557662 -3.739571 -0.177441
N  3.605918 2.9464 1.63565
C  -1.901501 1.156737 -1.950321
C  -2.534698 1.920966 -0.823958
C  -1.026168 1.92383 -0.976961
C  -1.955034 1.700462 -3.35717
C  -1.965856 -0.350107 -1.900273
C  -3.263529 3.176189 -1.040546
C  -0.209474 1.2262 0.030819
C  -4.383787 3.530747 -0.423224
C  2.003618 1.034376 0.863506
C  2.755564 -0.086811 0.192516
C  2.896424 2.114425 1.286788
C  2.296637 -1.388454 0.367553
C  3.850916 0.165323 -0.622402
C  2.944031 -2.444382 -0.255298
C  4.499524 -0.885481 -1.252353
C  4.046316 -2.171035 -1.059216
C  1.834605 -4.188996 0.900221
C  2.249332 -3.957148 2.205072
C  0.703296 -4.943569 0.63279
C  1.506362 -4.484981 3.250884
C  -0.021486 -5.478062 1.689099
C  0.371643 -5.245715 2.999305
H  -2.902999 1.300732 -0.014741
H  -0.57707 2.825098 -1.378831
H  -1.816884 2.779692 -3.409313
H  -1.172252 1.24386 -3.965244
H  -2.914395 1.462826 -3.820701
H  -2.055472 -0.74681 -0.89167
H  -2.836818 -0.693299 -2.461142
H  -1.082398 -0.794251 -2.362671
H  -2.858642 3.882214 -1.755926
H  1.498988 0.664476 1.760699
H  1.434055 -1.575379 0.994398
H  4.216831 1.173159 -0.771994
H  5.360768 -0.70804 -1.883069
H  3.140444 -3.376208 2.409695
H  0.397819 -5.116121 -0.391611
H  1.824145 -4.304176 4.269585
H  -0.90205 -6.072569 1.482344
H  -0.199638 -5.657972 3.820537
elementType: Cl F O N C H
totalener: -2149.93895443 hartree
nucrepener: 2880.68466127 hartree
electener: -5030.62361570 hartree
oneelecener: -8674.36704229 hartree
twoeener: 3643.74342659 hartree
cpcmener: -0.03050441 hartree
kineticenergy: 2143.45828152 hartree
xcener: -159.158940794791 hartree
chargesum: -0.0000000
charge: -0.055196 -0.059412 -0.207331 -0.274979 -0.446363 -0.319633 -0.086378 0.088994 0.029735 -0.093707 -0.264313 -0.268083 -0.203241 0.411828 0.042224 0.397563 -0.040687 -0.223306 -0.149878 -0.188068 0.217435 -0.160003 0.194304 0.277301 -0.197119 -0.236810 -0.138765 -0.123242 -0.177583 0.080076 0.098413 0.090757 0.099467 0.101962 0.095790 0.099238 0.100493 0.130079 0.134604 0.145610 0.142331 0.151756 0.159293 0.147410 0.159912 0.158437 0.159086
qa: -0.0552 -0.0594 -0.2073 -0.2750 -0.4464 -0.3196 -0.0864 0.0890 0.0297 -0.0937 -0.2643 -0.2681 -0.2032 0.4118 0.0422 0.3976 -0.0407 -0.2233 -0.1499 -0.1881 0.2174 -0.1600 0.1943 0.2773 -0.1971 -0.2368 -0.1388 -0.1232 -0.1776 0.0801 0.0984 0.0908 0.0995 0.1020 0.0958 0.0992 0.1005 0.1301 0.1346 0.1456 0.1423 0.1518 0.1593 0.1474 0.1599 0.1584 0.1591
va: 1.2701 1.2452 1.0850 2.1256 2.0667 2.0886 3.1101 3.7374 3.8662 3.8545 3.9068 3.9080 3.9001 4.1860 4.2143 3.7305 3.7654 4.0689 3.8625 3.9605 3.7230 3.9031 4.0672 3.6911 3.9308 4.0127 3.8865 3.8837 3.9051 1.0491 1.0323 1.0059 1.0012 1.0008 1.0171 1.0009 0.9992 1.0184 1.0231 1.0198 1.0086 0.9985 0.9946 1.0066 0.9897 0.9892 0.9900
dispcorr: -0.023315450 hartree
energy: -2149.962269882993
dipole: 8.43465 -8.91619 -0.48155 -19.98360 19.16969 -0.81391 -6.37184 5.29893 -1.07291
magnitude: 1.43020 au
magnitude: 3.63528 debye
