program: Orca
programVersion: 5.0.2
elementType: Cl Cl F O O O N C C C C C C C C C C C C C C C C C C C C C C H H H H H H H H H H H H H H H H H H
charge: 0
multiplicity: 1
keywords: wb97x-d3
keywords: def2-TZVPP
keywords: def2/J RIJCOSX
keywords: DEFGRID2
keywords: scfconv7
keywords: smallprint printgap noloewdin
keywords: NOSOSCF
formula: C22H18Cl2FNO3
InChI: InChI=1/C22H18Cl2FNO3/c1-22(2)15(11-19(23)24)20(22)21(27)29-18(12-26)13-8-9-16(25)17(10-13)28-14-6-4-3-5-7-14/h3-11,15,18,20H,1-2H3
47 atoms
Cl -2.341372 6.293617 -0.523483
Cl -4.697627 5.704456 -2.078398
F  2.664036 -3.066982 3.028835
O  0.173393 0.619665 -1.338662
O  0.633419 2.248966 0.121836
O  0.965526 -3.954632 1.081941
N  1.962765 -0.990736 -3.6082
C  -2.427415 1.947435 0.74582
C  -2.194755 3.170385 -0.090939
C  -1.630644 1.834513 -0.541127
C  -3.776442 1.26974 0.740745
C  -1.740929 1.876237 2.088175
C  -3.263358 3.782879 -0.888895
C  -0.172935 1.630611 -0.523587
C  -3.408664 5.081816 -1.118807
C  1.547627 0.242633 -1.343408
C  1.875395 -0.65936 -0.181071
C  1.758924 -0.443091 -2.619851
C  1.297493 -1.923182 -0.09897
C  2.727541 -0.219021 0.81976
C  1.569008 -2.739189 0.981843
C  3.003036 -1.031535 1.910451
C  2.416042 -2.274647 1.983573
C  1.723951 -5.093686 1.009938
C  1.098817 -6.266419 1.415599
C  3.028623 -5.113835 0.536645
C  1.792711 -7.464359 1.357554
C  3.711844 -6.323048 0.491918
C  3.104731 -7.500143 0.901825
H  -1.457794 3.855794 0.312123
H  -2.147137 1.339527 -1.355501
H  -3.680195 0.245237 1.104294
H  -4.469508 1.792133 1.402942
H  -4.230387 1.219142 -0.248205
H  -2.418207 2.24753 2.859384
H  -1.488157 0.844846 2.341663
H  -0.831902 2.470307 2.143627
H  -3.999869 3.127554 -1.338288
H  2.199158 1.121834 -1.336386
H  0.632852 -2.289443 -0.873592
H  3.183118 0.760335 0.758635
H  3.661808 -0.6981 2.701524
H  0.077176 -6.236855 1.773539
H  3.521243 -4.21211 0.195301
H  1.302739 -8.375488 1.676087
H  4.731332 -6.336098 0.128365
H  3.646033 -8.436271 0.864548
elementType: Cl F O N C H
totalener: -2149.93969717 hartree
nucrepener: 2845.71599043 hartree
electener: -4995.65568760 hartree
oneelecener: -8604.56798578 hartree
twoeener: 3608.91229819 hartree
cpcmener: -0.03158246 hartree
kineticenergy: 2143.46240533 hartree
xcener: -159.158403077570 hartree
chargesum: 0.0000000
charge: -0.054702 -0.059858 -0.205042 -0.283047 -0.443927 -0.323413 -0.086784 0.089616 0.027825 -0.078104 -0.269601 -0.267113 -0.201955 0.396682 0.042945 0.425185 -0.032397 -0.233438 -0.157692 -0.133098 0.111941 -0.169413 0.263622 0.291710 -0.245992 -0.174953 -0.122803 -0.166003 -0.184318 0.080637 0.098031 0.098931 0.102781 0.092269 0.099007 0.100193 0.095380 0.128640 0.139106 0.139174 0.148363 0.153057 0.144929 0.150796 0.156887 0.158406 0.157538
qa: -0.0547 -0.0599 -0.2050 -0.2830 -0.4439 -0.3234 -0.0868 0.0896 0.0278 -0.0781 -0.2696 -0.2671 -0.2020 0.3967 0.0429 0.4252 -0.0324 -0.2334 -0.1577 -0.1331 0.1119 -0.1694 0.2636 0.2917 -0.2460 -0.1750 -0.1228 -0.1660 -0.1843 0.0806 0.0980 0.0989 0.1028 0.0923 0.0990 0.1002 0.0954 0.1286 0.1391 0.1392 0.1484 0.1531 0.1449 0.1508 0.1569 0.1584 0.1575
va: 1.2712 1.2447 1.0891 2.1345 2.0706 2.0776 3.1115 3.7398 3.8775 3.8455 3.9095 3.9056 3.9004 4.1932 4.2148 3.7135 3.6416 4.0722 4.0322 3.9071 3.8204 3.9161 3.9980 3.6823 3.9879 3.8661 3.9000 3.9182 3.9028 1.0475 1.0323 1.0014 1.0002 1.0060 1.0006 0.9989 1.0180 1.0201 1.0151 1.0200 1.0069 0.9980 1.0089 1.0047 0.9892 0.9910 0.9903
dispcorr: -0.023440890 hartree
energy: -2149.963138055654
dipole: 5.36595 -5.70416 -0.33820 -29.85880 29.55043 -0.30837 12.44740 -11.19828 1.24912
magnitude: 1.33032 au
magnitude: 3.38142 debye
