program: Orca
programVersion: 5.0.2
elementType: Cl Cl F O O O N C C C C C C C C C C C C C C C C C C C C C C H H H H H H H H H H H H H H H H H H
charge: 0
multiplicity: 1
keywords: wb97x-d3
keywords: def2-TZVPP
keywords: def2/J RIJCOSX
keywords: DEFGRID2
keywords: scfconv7
keywords: smallprint printgap noloewdin
keywords: NOSOSCF
formula: C22H18Cl2FNO3
InChI: InChI=1/C22H18Cl2FNO3/c1-22(2)15(11-19(23)24)20(22)21(27)29-18(12-26)13-8-9-16(25)17(10-13)28-14-6-4-3-5-7-14/h3-11,15,18,20H,1-2H3
47 atoms
Cl -5.330772 2.239361 0.452843
Cl -5.305803 4.976132 -0.45953
F  4.437221 -3.018751 -1.885974
O  1.047882 1.783243 0.26267
O  -0.573767 0.274861 0.574382
O  2.473535 -3.700684 -0.289406
N  3.652008 2.711427 2.051374
C  -1.673004 1.618768 -2.048135
C  -2.46549 2.076824 -0.857828
C  -0.952188 2.175011 -0.83397
C  -1.613225 2.473894 -3.29039
C  -1.65252 0.14072 -2.349732
C  -3.248951 3.317987 -0.883123
C  -0.188983 1.297472 0.068812
C  -4.459478 3.478546 -0.364001
C  1.926668 1.008602 1.076133
C  2.616112 -0.07115 0.278575
C  2.88909 1.971801 1.616118
C  2.216525 -1.394462 0.436215
C  3.605575 0.259432 -0.637444
C  2.826582 -2.393932 -0.30619
C  4.223047 -0.73604 -1.378061
C  3.838153 -2.044761 -1.19534
C  1.900755 -4.276671 0.815051
C  0.80799 -5.101825 0.594949
C  2.428042 -4.112633 2.08878
C  0.23986 -5.777702 1.665101
C  1.840774 -4.784739 3.151254
C  0.749771 -5.618993 2.946209
H  -2.875442 1.273594 -0.255994
H  -0.527762 3.163201 -0.970176
H  -0.745119 2.198363 -3.891484
H  -2.503351 2.321467 -3.903374
H  -1.531874 3.538668 -3.075333
H  -1.806491 -0.483348 -1.472585
H  -2.449232 -0.09368 -3.05784
H  -0.706611 -0.149253 -2.811168
H  -2.811664 4.182911 -1.367313
H  1.393288 0.574168 1.927081
H  1.429377 -1.641059 1.137173
H  3.915137 1.287471 -0.777663
H  5.006467 -0.497978 -2.085501
H  0.414408 -5.221279 -0.406818
H  3.2888 -3.476872 2.255604
H  -0.607363 -6.428801 1.492366
H  2.249271 -4.659836 4.145661
H  0.303665 -6.145848 3.779365
elementType: Cl F O N C H
totalener: -2149.93906139 hartree
nucrepener: 2875.92537870 hartree
electener: -5025.86444010 hartree
oneelecener: -8664.96055213 hartree
twoeener: 3639.09611204 hartree
cpcmener: -0.03103547 hartree
kineticenergy: 2143.46438480 hartree
xcener: -159.160198832680 hartree
chargesum: -0.0000000
charge: -0.054758 -0.059510 -0.207147 -0.274067 -0.447605 -0.319296 -0.087950 0.086399 0.031279 -0.090740 -0.263895 -0.268594 -0.200459 0.408400 0.039573 0.401824 -0.040751 -0.225457 -0.144325 -0.186850 0.212559 -0.166620 0.198608 0.287681 -0.244523 -0.202536 -0.120482 -0.138794 -0.180212 0.081038 0.098774 0.099361 0.101710 0.090998 0.095398 0.099753 0.100921 0.129118 0.136880 0.144302 0.144765 0.151843 0.147626 0.159149 0.158327 0.160011 0.158273
qa: -0.0548 -0.0595 -0.2071 -0.2741 -0.4476 -0.3193 -0.0879 0.0864 0.0313 -0.0907 -0.2639 -0.2686 -0.2005 0.4084 0.0396 0.4018 -0.0408 -0.2255 -0.1443 -0.1869 0.2126 -0.1666 0.1986 0.2877 -0.2445 -0.2025 -0.1205 -0.1388 -0.1802 0.0810 0.0988 0.0994 0.1017 0.0910 0.0954 0.0998 0.1009 0.1291 0.1369 0.1443 0.1448 0.1518 0.1476 0.1591 0.1583 0.1600 0.1583
va: 1.2709 1.2453 1.0850 2.1340 2.0650 2.0885 3.1112 3.7373 3.8697 3.8574 3.9064 3.9063 3.8949 4.1862 4.2145 3.7353 3.7095 4.0688 3.8902 3.9552 3.7326 3.9013 4.0631 3.6893 4.0144 3.9310 3.8829 3.8861 3.9072 1.0476 1.0322 1.0013 1.0010 1.0059 1.0179 1.0005 0.9989 1.0188 1.0172 1.0207 1.0070 0.9986 1.0071 0.9954 0.9892 0.9897 0.9903
dispcorr: -0.023333223 hartree
energy: -2149.962394617341
dipole: 11.65563 -12.04504 -0.38941 -16.57353 16.17482 -0.39871 -6.95845 5.98224 -0.97622
magnitude: 1.12411 au
magnitude: 2.85725 debye
