program: Orca
programVersion: 5.0.2
elementType: Cl Cl F O O O N C C C C C C C C C C C C C C C C C C C C C C H H H H H H H H H H H H H H H H H H
charge: 0
multiplicity: 1
keywords: wb97x-d3
keywords: def2-TZVPP
keywords: def2/J RIJCOSX
keywords: DEFGRID2
keywords: scfconv7
keywords: smallprint printgap noloewdin
keywords: NOSOSCF
formula: C22H18Cl2FNO3
InChI: InChI=1/C22H18Cl2FNO3/c1-22(2)15(11-19(23)24)20(22)21(27)29-18(12-26)13-8-9-16(25)17(10-13)28-14-6-4-3-5-7-14/h3-11,15,18,20H,1-2H3
47 atoms
Cl -5.391192 2.278421 0.178745
Cl -5.260453 5.098164 -0.41023
F  4.362513 -2.874992 -1.927527
O  0.89326 1.735705 0.433933
O  -0.709945 0.18197 0.33479
O  2.505425 -3.745436 -0.285789
N  3.303605 2.414942 2.578025
C  -1.581198 1.858112 -2.178638
C  -2.468298 2.187442 -1.013616
C  -0.960059 2.250394 -0.851069
C  -1.405681 2.852958 -3.300189
C  -1.55066 0.426351 -2.653198
C  -3.226535 3.441943 -0.939529
C  -0.293778 1.265857 0.016767
C  -4.455022 3.575857 -0.455571
C  1.677813 0.865145 1.243991
C  2.43278 -0.137642 0.407523
C  2.584263 1.746473 1.982318
C  2.115228 -1.48596 0.515785
C  3.392666 0.290267 -0.500287
C  2.775186 -2.417992 -0.27027
C  4.047907 -0.635097 -1.296646
C  3.737406 -1.971036 -1.169006
C  2.056388 -4.394717 0.834974
C  2.599852 -4.171331 2.093339
C  1.068624 -5.350071 0.645004
C  2.129602 -4.909671 3.170347
C  0.619303 -6.090121 1.728841
C  1.14131 -5.869189 2.995839
H  -2.935608 1.326679 -0.548682
H  -0.51827 3.240094 -0.829648
H  -0.490105 2.634707 -3.852674
H  -2.239055 2.790553 -4.002307
H  -1.336044 3.883541 -2.954602
H  -0.572686 0.174881 -3.068029
H  -1.782034 -0.294146 -1.872487
H  -2.28813 0.29348 -3.44664
H  -2.748202 4.344029 -1.302073
H  1.057628 0.351484 1.984999
H  1.349873 -1.804952 1.211926
H  3.642375 1.339632 -0.595247
H  4.802016 -0.323843 -2.007729
H  3.382474 -3.437606 2.241034
H  0.663116 -5.516853 -0.3452
H  2.548239 -4.734748 4.153033
H  -0.147582 -6.838874 1.577972
H  0.783783 -6.442788 3.840753
elementType: Cl F O N C H
totalener: -2149.93931165 hartree
nucrepener: 2867.98545986 hartree
electener: -5017.92477151 hartree
oneelecener: -8649.07523191 hartree
twoeener: 3631.15046039 hartree
cpcmener: -0.03167494 hartree
kineticenergy: 2143.46679358 hartree
xcener: -159.160769714957 hartree
chargesum: -0.0000000
charge: -0.054622 -0.059624 -0.206956 -0.276322 -0.446274 -0.320080 -0.087826 0.085751 0.030722 -0.083631 -0.264319 -0.266359 -0.200737 0.402357 0.039808 0.400132 -0.026003 -0.225207 -0.152043 -0.197983 0.217367 -0.163195 0.197070 0.295732 -0.206918 -0.250629 -0.138737 -0.116291 -0.185323 0.080804 0.097779 0.098802 0.101837 0.091195 0.100131 0.095608 0.098817 0.129480 0.136057 0.145917 0.148223 0.151874 0.159105 0.147376 0.160200 0.158235 0.158702
qa: -0.0546 -0.0596 -0.2070 -0.2763 -0.4463 -0.3201 -0.0878 0.0858 0.0307 -0.0836 -0.2643 -0.2664 -0.2007 0.4024 0.0398 0.4001 -0.0260 -0.2252 -0.1520 -0.1980 0.2174 -0.1632 0.1971 0.2957 -0.2069 -0.2506 -0.1387 -0.1163 -0.1853 0.0808 0.0978 0.0988 0.1018 0.0912 0.1001 0.0956 0.0988 0.1295 0.1361 0.1459 0.1482 0.1519 0.1591 0.1474 0.1602 0.1582 0.1587
va: 1.2711 1.2452 1.0852 2.1366 2.0678 2.0905 3.1120 3.7384 3.8730 3.8519 3.9074 3.9047 3.8961 4.1865 4.2143 3.7463 3.6697 4.0668 3.9038 3.9549 3.7202 3.8952 4.0684 3.6867 3.9247 4.0127 3.8863 3.8800 3.9108 1.0472 1.0328 1.0014 1.0011 1.0059 0.9992 1.0183 1.0005 1.0189 1.0173 1.0150 1.0064 0.9982 0.9953 1.0076 0.9897 0.9891 0.9904
dispcorr: -0.023255918 hartree
energy: -2149.962567567621
dipole: 13.43686 -13.67812 -0.24126 -15.77431 15.57929 -0.19502 -7.12789 6.07614 -1.05175
magnitude: 1.09654 au
magnitude: 2.78719 debye
