program: Orca
programVersion: 5.0.2
elementType: Cl Cl F O O O N C C C C C C C C C C C C C C C C C C C C C C H H H H H H H H H H H H H H H H H H
charge: 0
multiplicity: 1
keywords: wb97x-d3
keywords: def2-TZVPP
keywords: def2/J RIJCOSX
keywords: DEFGRID2
keywords: scfconv7
keywords: smallprint printgap noloewdin
keywords: NOSOSCF
formula: C22H18Cl2FNO3
InChI: InChI=1/C22H18Cl2FNO3/c1-22(2)15(11-19(23)24)20(22)21(27)29-18(12-26)13-8-9-16(25)17(10-13)28-14-6-4-3-5-7-14/h3-11,15,18,20H,1-2H3
47 atoms
Cl -5.028709 3.770752 1.019692
Cl -4.698843 6.211571 -0.483576
F  1.409045 -4.29422 -1.393837
O  1.039807 1.831073 -0.194783
O  -0.704707 0.962669 0.896861
O  1.407594 -3.847775 1.294189
N  4.322268 1.865945 0.167173
C  -2.109423 1.903484 -1.777047
C  -2.530232 2.760542 -0.616614
C  -1.058166 2.533734 -0.879601
C  -2.189219 2.440766 -3.185246
C  -2.397409 0.424379 -1.69625
C  -3.078444 4.108241 -0.814655
C  -0.276242 1.698274 0.046735
C  -4.125475 4.615919 -0.177348
C  1.900235 0.946764 0.510486
C  1.796726 -0.468226 -0.008049
C  3.250055 1.478808 0.305453
C  1.688787 -1.522645 0.887645
C  1.80079 -0.7098 -1.376149
C  1.570662 -2.819569 0.418595
C  1.671791 -2.00476 -1.852533
C  1.549267 -3.04151 -0.952417
C  2.35446 -4.83815 1.342588
C  1.945849 -6.053461 1.875665
C  3.663813 -4.652207 0.919988
C  2.857009 -7.093285 1.975705
C  4.561866 -5.707002 1.020729
C  4.166867 -6.929675 1.542842
H  -2.930874 2.208332 0.225966
H  -0.506404 3.352665 -1.327822
H  -1.547216 1.855295 -3.845617
H  -3.209921 2.365037 -3.564856
H  -1.876425 3.480754 -3.270745
H  -1.624597 -0.151875 -2.209358
H  -2.476002 0.053106 -0.676793
H  -3.347062 0.213185 -2.191236
H  -2.594482 4.750871 -1.540514
H  1.701981 0.972268 1.587148
H  1.685079 -1.344081 1.956274
H  1.895661 0.104003 -2.083673
H  1.660306 -2.208799 -2.915175
H  0.922417 -6.181491 2.205802
H  3.997551 -3.702681 0.520265
H  2.535477 -8.040958 2.388124
H  5.581307 -5.562747 0.68652
H  4.872431 -7.746891 1.614083
elementType: Cl F O N C H
totalener: -2149.93881973 hartree
nucrepener: 2853.06446954 hartree
electener: -5003.00328927 hartree
oneelecener: -8619.20790530 hartree
twoeener: 3616.20461603 hartree
cpcmener: -0.03328285 hartree
kineticenergy: 2143.46591716 hartree
xcener: -159.159080721256 hartree
chargesum: 0.0000000
charge: -0.054662 -0.059658 -0.206692 -0.278666 -0.430482 -0.323774 -0.086340 0.089418 0.033333 -0.067863 -0.263260 -0.264959 -0.204519 0.356097 0.040620 0.410599 0.013562 -0.227770 -0.182953 -0.198937 0.144776 -0.166539 0.277951 0.270775 -0.238833 -0.165926 -0.124010 -0.164019 -0.182146 0.081405 0.100172 0.098216 0.102450 0.091089 0.095694 0.097079 0.101567 0.129584 0.141511 0.140226 0.150836 0.153378 0.145779 0.152746 0.156627 0.158836 0.157681
qa: -0.0547 -0.0597 -0.2067 -0.2787 -0.4305 -0.3238 -0.0863 0.0894 0.0333 -0.0679 -0.2633 -0.2650 -0.2045 0.3561 0.0406 0.4106 0.0136 -0.2278 -0.1830 -0.1989 0.1448 -0.1665 0.2780 0.2708 -0.2388 -0.1659 -0.1240 -0.1640 -0.1821 0.0814 0.1002 0.0982 0.1024 0.0911 0.0957 0.0971 0.1016 0.1296 0.1415 0.1402 0.1508 0.1534 0.1458 0.1527 0.1566 0.1588 0.1577
va: 1.2710 1.2451 1.0853 2.1234 2.0817 2.0746 3.1121 3.7400 3.8772 3.8241 3.9052 3.9038 3.8953 4.2477 4.2129 3.7102 3.5980 4.0851 4.0276 3.9244 3.7810 3.9109 3.9891 3.6846 3.9905 3.8658 3.9013 3.9180 3.8994 1.0474 1.0316 1.0014 1.0008 1.0056 1.0004 1.0165 1.0013 1.0183 1.0165 1.0139 1.0102 0.9976 1.0084 1.0022 0.9892 0.9908 0.9902
dispcorr: -0.024189351 hartree
energy: -2149.963009080119
dipole: 16.87728 -17.13297 -0.25570 -23.75338 23.40386 -0.34952 -10.59035 9.22736 -1.36299
magnitude: 1.43013 au
magnitude: 3.63510 debye
