program: Orca
programVersion: 5.0.2
elementType: Cl Cl F O O O N C C C C C C C C C C C C C C C C C C C C C C H H H H H H H H H H H H H H H H H H
charge: 0
multiplicity: 1
keywords: wb97x-d3
keywords: def2-TZVPP
keywords: def2/J RIJCOSX
keywords: DEFGRID2
keywords: scfconv7
keywords: smallprint printgap noloewdin
keywords: NOSOSCF
formula: C22H18Cl2FNO3
InChI: InChI=1/C22H18Cl2FNO3/c1-22(2)15(11-19(23)24)20(22)21(27)29-18(12-26)13-8-9-16(25)17(10-13)28-14-6-4-3-5-7-14/h3-11,15,18,20H,1-2H3
47 atoms
Cl -5.349589 2.314019 0.429066
Cl -5.204568 5.055439 -0.457341
F  4.539665 -3.110176 -1.794924
O  0.984183 1.645278 0.16649
O  -0.651933 0.150955 0.464841
O  2.578854 -3.824845 -0.192473
N  3.481275 2.63694 2.068805
C  -1.793272 1.508512 -2.12953
C  -2.51643 2.024522 -0.919681
C  -0.999032 2.04857 -0.955937
C  -1.745121 2.340265 -3.388219
C  -1.858652 0.027159 -2.40709
C  -3.238303 3.302707 -0.930649
C  -0.251396 1.164527 -0.045715
C  -4.431404 3.517466 -0.390816
C  1.837626 0.893452 1.026739
C  2.582551 -0.179059 0.272262
C  2.755324 1.878335 1.603744
C  2.218755 -1.509703 0.446168
C  3.592513 0.163183 -0.616897
C  2.881071 -2.506369 -0.2546
C  4.255571 -0.827985 -1.322528
C  3.89965 -2.143971 -1.129813
C  1.972552 -4.346139 0.924475
C  2.533277 -4.196835 2.185607
C  0.817204 -5.08721 0.737716
C  1.917604 -4.801769 3.27131
C  0.218762 -5.697224 1.831672
C  0.762681 -5.553751 3.099992
H  -2.938983 1.251565 -0.288054
H  -0.536522 3.014027 -1.126033
H  -1.597074 3.402303 -3.197055
H  -0.923523 2.008284 -4.024845
H  -2.67061 2.227465 -3.955535
H  -0.945158 -0.31798 -2.894939
H  -2.014162 -0.575159 -1.515352
H  -2.690068 -0.175547 -3.084496
H  -2.764921 4.147737 -1.416356
H  1.272747 0.455836 1.855246
H  1.419201 -1.765567 1.129864
H  3.880792 1.196488 -0.763621
H  5.053203 -0.581757 -2.011108
H  3.441916 -3.623493 2.321138
H  0.396123 -5.192174 -0.254201
H  2.351441 -4.690047 4.256485
H  -0.68048 -6.281688 1.688072
H  0.291858 -6.027588 3.95121
elementType: Cl F O N C H
totalener: -2149.93931862 hartree
nucrepener: 2870.63104427 hartree
electener: -5020.57036290 hartree
oneelecener: -8654.40403111 hartree
twoeener: 3633.83366822 hartree
cpcmener: -0.03103755 hartree
kineticenergy: 2143.47123770 hartree
xcener: -159.160764480842 hartree
chargesum: 0.0000000
charge: -0.054962 -0.059283 -0.207631 -0.275838 -0.448999 -0.321198 -0.088357 0.087125 0.030418 -0.093353 -0.261680 -0.268515 -0.199741 0.411748 0.039859 0.401220 -0.045544 -0.224057 -0.125157 -0.188666 0.195806 -0.167357 0.204087 0.256261 -0.180170 -0.225441 -0.144724 -0.129768 -0.169602 0.081825 0.097786 0.090553 0.099321 0.101488 0.100951 0.094764 0.099073 0.129670 0.135629 0.142863 0.144704 0.151634 0.158965 0.148167 0.159675 0.158251 0.158201
qa: -0.0550 -0.0593 -0.2076 -0.2758 -0.4490 -0.3212 -0.0884 0.0871 0.0304 -0.0934 -0.2617 -0.2685 -0.1997 0.4117 0.0399 0.4012 -0.0455 -0.2241 -0.1252 -0.1887 0.1958 -0.1674 0.2041 0.2563 -0.1802 -0.2254 -0.1447 -0.1298 -0.1696 0.0818 0.0978 0.0906 0.0993 0.1015 0.1010 0.0948 0.0991 0.1297 0.1356 0.1429 0.1447 0.1516 0.1590 0.1482 0.1597 0.1583 0.1582
va: 1.2705 1.2457 1.0846 2.1339 2.0635 2.0827 3.1107 3.7310 3.8668 3.8677 3.9074 3.9064 3.8953 4.1765 4.2134 3.7368 3.7134 4.0676 3.8704 3.9556 3.7364 3.9044 4.0629 3.7125 3.9328 4.0076 3.8901 3.8877 3.8982 1.0473 1.0329 1.0057 1.0015 1.0010 0.9989 1.0184 1.0002 1.0181 1.0184 1.0204 1.0070 0.9986 0.9950 1.0058 0.9899 0.9894 0.9902
dispcorr: -0.023228379 hartree
energy: -2149.962547002185
dipole: 10.56538 -10.99610 -0.43072 -17.19752 16.74559 -0.45193 -7.10757 6.11890 -0.98867
magnitude: 1.16929 au
magnitude: 2.97210 debye
