program: Orca
programVersion: 5.0.2
elementType: Cl Cl F O O O N C C C C C C C C C C C C C C C C C C C C C C H H H H H H H H H H H H H H H H H H
charge: 0
multiplicity: 1
keywords: wb97x-d3
keywords: def2-TZVPP
keywords: def2/J RIJCOSX
keywords: DEFGRID2
keywords: scfconv7
keywords: smallprint printgap noloewdin
keywords: NOSOSCF
formula: C22H18Cl2FNO3
InChI: InChI=1/C22H18Cl2FNO3/c1-22(2)15(11-19(23)24)20(22)21(27)29-18(12-26)13-8-9-16(25)17(10-13)28-14-6-4-3-5-7-14/h3-11,15,18,20H,1-2H3
47 atoms
Cl -2.388622 6.321236 -0.60662
Cl -4.688971 5.657563 -2.215905
F  2.792174 -3.03062 3.144896
O  0.139057 0.560694 -1.226928
O  0.629595 2.250584 0.152393
O  1.031311 -3.957165 1.2934
N  1.866947 -1.102071 -3.497308
C  -2.438612 2.052137 0.79253
C  -2.183919 3.210273 -0.126295
C  -1.643861 1.836732 -0.482175
C  -3.801063 1.402205 0.83033
C  -1.7569 2.064533 2.138943
C  -3.242099 3.785624 -0.964753
C  -0.188951 1.612825 -0.45785
C  -3.408324 5.077333 -1.21967
C  1.513638 0.185952 -1.252029
C  1.873423 -0.683142 -0.074461
C  1.694262 -0.534877 -2.513875
C  1.304982 -1.947411 0.053464
C  2.751089 -0.215589 0.891498
C  1.616782 -2.73777 1.14186
C  3.068478 -1.004116 1.988764
C  2.497064 -2.251686 2.10229
C  1.789736 -5.086901 1.131824
C  1.210388 -6.275006 1.560382
C  3.051611 -5.082057 0.553321
C  1.905953 -7.464138 1.412438
C  3.737147 -6.283232 0.418152
C  3.174674 -7.476161 0.84549
H  -1.43538 3.908898 0.230534
H  -2.170228 1.29724 -1.261323
H  -3.724123 0.397841 1.250507
H  -4.4802 1.975422 1.464705
H  -4.261499 1.306064 -0.152304
H  -2.425255 2.512366 2.876919
H  -1.533149 1.048995 2.471993
H  -0.831605 2.636097 2.152665
H  -3.952424 3.106998 -1.421564
H  2.16325 1.065979 -1.285109
H  0.61862 -2.334201 -0.691592
H  3.196551 0.765907 0.795827
H  3.750178 -0.649295 2.750428
H  0.222774 -6.264077 2.004573
H  3.508341 -4.166841 0.19847
H  1.451627 -8.387685 1.747691
H  4.722527 -6.277275 -0.029826
H  3.716441 -8.406434 0.736325
elementType: Cl F O N C H
totalener: -2149.93988124 hartree
nucrepener: 2840.35687630 hartree
electener: -4990.29675755 hartree
oneelecener: -8593.84649811 hartree
twoeener: 3603.54974056 hartree
cpcmener: -0.03159266 hartree
kineticenergy: 2143.46254605 hartree
xcener: -159.158301785804 hartree
chargesum: 0.0000000
charge: -0.054769 -0.059489 -0.204934 -0.283117 -0.445070 -0.324225 -0.087133 0.087743 0.031247 -0.084437 -0.265587 -0.266903 -0.202177 0.400822 0.041581 0.424083 -0.035638 -0.233412 -0.149623 -0.128349 0.104068 -0.174616 0.268474 0.287556 -0.241918 -0.169164 -0.124689 -0.170465 -0.182567 0.080866 0.097727 0.099138 0.101744 0.091456 0.098963 0.100637 0.095165 0.129464 0.139438 0.139273 0.148810 0.152951 0.145221 0.149169 0.156477 0.158541 0.157666
qa: -0.0548 -0.0595 -0.2049 -0.2831 -0.4451 -0.3242 -0.0871 0.0877 0.0312 -0.0844 -0.2656 -0.2669 -0.2022 0.4008 0.0416 0.4241 -0.0356 -0.2334 -0.1496 -0.1283 0.1041 -0.1746 0.2685 0.2876 -0.2419 -0.1692 -0.1247 -0.1705 -0.1826 0.0809 0.0977 0.0991 0.1017 0.0915 0.0990 0.1006 0.0952 0.1295 0.1394 0.1393 0.1488 0.1530 0.1452 0.1492 0.1565 0.1585 0.1577
va: 1.2709 1.2452 1.0897 2.1350 2.0696 2.0774 3.1111 3.7371 3.8731 3.8571 3.9088 3.9051 3.8990 4.1866 4.2144 3.7134 3.6405 4.0714 4.0240 3.9036 3.8289 3.9185 4.0020 3.6845 3.9863 3.8605 3.9028 3.9225 3.9004 1.0474 1.0329 1.0015 1.0006 1.0058 1.0004 0.9991 1.0181 1.0191 1.0153 1.0193 1.0064 0.9981 1.0087 1.0056 0.9894 0.9910 0.9902
dispcorr: -0.023348646 hartree
energy: -2149.963229889376
dipole: 5.39104 -5.70421 -0.31316 -28.94436 28.72240 -0.22195 12.81448 -11.60561 1.20887
magnitude: 1.26835 au
magnitude: 3.22388 debye
