program: Orca
programVersion: 5.0.2
elementType: Cl Cl F O O O N C C C C C C C C C C C C C C C C C C C C C C H H H H H H H H H H H H H H H H H H
charge: 0
multiplicity: 1
keywords: wb97x-d3
keywords: def2-TZVPP
keywords: def2/J RIJCOSX
keywords: DEFGRID2
keywords: scfconv7
keywords: smallprint printgap noloewdin
keywords: NOSOSCF
formula: C22H18Cl2FNO3
InChI: InChI=1/C22H18Cl2FNO3/c1-22(2)15(11-19(23)24)20(22)21(27)29-18(12-26)13-8-9-16(25)17(10-13)28-14-6-4-3-5-7-14/h3-11,15,18,20H,1-2H3
47 atoms
Cl -2.573833 6.224976 -0.53736
Cl -4.777583 5.52677 -2.264231
F  2.520329 -3.07488 3.219269
O  0.253734 0.67345 -1.187574
O  0.542246 2.298773 0.320816
O  1.050963 -3.958195 1.102749
N  2.271308 -0.699506 -3.414287
C  -2.538875 1.900707 0.733243
C  -2.293739 3.114941 -0.111748
C  -1.651692 1.793004 -0.494381
C  -3.859225 1.173455 0.649215
C  -1.950432 1.884612 2.122714
C  -3.327087 3.673194 -0.990736
C  -0.191292 1.652376 -0.381461
C  -3.522826 4.964242 -1.225975
C  1.641927 0.358497 -1.110064
C  1.920849 -0.582444 0.033765
C  1.97691 -0.240704 -2.403728
C  1.39954 -1.872951 0.016732
C  2.653658 -0.14421 1.126807
C  1.607466 -2.716386 1.091087
C  2.867158 -0.985035 2.209434
C  2.336065 -2.25502 2.182844
C  1.850002 -5.061924 0.970656
C  3.181952 -5.001455 0.584347
C  1.240027 -6.285469 1.221367
C  3.904581 -6.182432 0.46401
C  1.974095 -7.452981 1.091413
C  3.311349 -7.409696 0.716478
H  -1.610132 3.833752 0.325749
H  -2.09299 1.264779 -1.331764
H  -3.753428 0.161283 1.043533
H  -4.616055 1.684196 1.247551
H  -4.238967 1.085034 -0.368045
H  -1.694681 0.867462 2.425821
H  -1.061254 2.501921 2.225069
H  -2.691021 2.261892 2.830367
H  -3.991342 2.982293 -1.49588
H  2.24777 1.264114 -1.00977
H  0.82566 -2.237611 -0.827995
H  3.061924 0.85747 1.144543
H  3.431474 -0.653187 3.071074
H  3.666142 -4.057692 0.367342
H  0.198142 -6.31824 1.515061
H  4.944214 -6.132824 0.166623
H  1.495044 -8.403512 1.288577
H  3.882187 -8.323783 0.619989
elementType: Cl F O N C H
totalener: -2149.93971555 hartree
nucrepener: 2842.72765166 hartree
electener: -4992.66736721 hartree
oneelecener: -8598.54459470 hartree
twoeener: 3605.87722748 hartree
cpcmener: -0.03151723 hartree
kineticenergy: 2143.46306894 hartree
xcener: -159.158298983767 hartree
chargesum: -0.0000000
charge: -0.054890 -0.059431 -0.204928 -0.283402 -0.445114 -0.323002 -0.086828 0.086849 0.032450 -0.084011 -0.267840 -0.267557 -0.202208 0.400190 0.042703 0.426765 -0.036058 -0.232732 -0.153550 -0.127276 0.106845 -0.173867 0.266196 0.295774 -0.175206 -0.247195 -0.167511 -0.122108 -0.184850 0.081000 0.098177 0.098935 0.102570 0.092348 0.099697 0.095744 0.098996 0.129182 0.136906 0.140200 0.148250 0.153609 0.148893 0.144668 0.158570 0.156904 0.157142
qa: -0.0549 -0.0594 -0.2049 -0.2834 -0.4451 -0.3230 -0.0868 0.0868 0.0325 -0.0840 -0.2678 -0.2676 -0.2022 0.4002 0.0427 0.4268 -0.0361 -0.2327 -0.1536 -0.1273 0.1068 -0.1739 0.2662 0.2958 -0.1752 -0.2472 -0.1675 -0.1221 -0.1849 0.0810 0.0982 0.0989 0.1026 0.0923 0.0997 0.0957 0.0990 0.1292 0.1369 0.1402 0.1483 0.1536 0.1489 0.1447 0.1586 0.1569 0.1571
va: 1.2707 1.2452 1.0898 2.1351 2.0686 2.0785 3.1112 3.7352 3.8722 3.8550 3.9087 3.9050 3.9016 4.1879 4.2146 3.7159 3.6521 4.0688 4.0312 3.9008 3.8237 3.9157 4.0056 3.6821 3.8660 3.9879 3.9203 3.9002 3.9035 1.0477 1.0325 1.0015 1.0004 1.0059 0.9993 1.0183 1.0002 1.0195 1.0165 1.0188 1.0069 0.9978 1.0063 1.0091 0.9909 0.9892 0.9904
dispcorr: -0.023343687 hartree
energy: -2149.963059241446
dipole: 5.78680 -6.20951 -0.42271 -29.43919 29.06064 -0.37855 12.16369 -10.90964 1.25404
magnitude: 1.37645 au
magnitude: 3.49866 debye
