program: Orca
programVersion: 5.0.2
elementType: Cl Cl F O O O N C C C C C C C C C C C C C C C C C C C C C C H H H H H H H H H H H H H H H H H H
charge: 0
multiplicity: 1
keywords: wb97x-d3
keywords: def2-TZVPP
keywords: def2/J RIJCOSX
keywords: DEFGRID2
keywords: scfconv7
keywords: smallprint printgap noloewdin
keywords: NOSOSCF
formula: C22H18Cl2FNO3
InChI: InChI=1/C22H18Cl2FNO3/c1-22(2)15(11-19(23)24)20(22)21(27)29-18(12-26)13-8-9-16(25)17(10-13)28-14-6-4-3-5-7-14/h3-11,15,18,20H,1-2H3
47 atoms
Cl -4.791387 4.195181 0.840163
Cl -4.641501 5.93353 -1.456356
F  2.761542 -4.134638 -1.394139
O  1.025193 1.666149 -0.282003
O  -0.606984 1.21738 1.186919
O  1.037093 -3.712087 0.679441
N  4.099727 2.605492 0.482099
C  -2.284439 1.301425 -1.477921
C  -2.565303 2.518025 -0.641857
C  -1.132851 2.143295 -0.958179
C  -2.502394 1.336483 -2.971042
C  -2.584555 -0.048158 -0.872708
C  -3.113197 3.747922 -1.226973
C  -0.259526 1.631492 0.111692
C  -4.048037 4.514331 -0.679328
C  2.000946 1.053711 0.560943
C  2.285805 -0.343184 0.071287
C  3.176992 1.922865 0.505954
C  1.613633 -1.408943 0.660549
C  3.128575 -0.568775 -1.00945
C  1.769177 -2.689792 0.160664
C  3.303447 -1.851757 -1.504309
C  2.617272 -2.894597 -0.921036
C  1.669435 -4.757383 1.300101
C  2.956753 -4.669317 1.810567
C  0.929425 -5.92533 1.432919
C  3.503659 -5.772637 2.453562
C  1.488021 -7.01411 2.082825
C  2.778375 -6.946441 2.593242
H  -2.877325 2.300407 0.373359
H  -0.626767 2.737787 -1.710572
H  -2.189901 2.273336 -3.430369
H  -1.934332 0.536346 -3.448981
H  -3.556481 1.180877 -3.208459
H  -2.557142 -0.052257 0.21459
H  -3.585766 -0.363489 -1.17154
H  -1.882023 -0.802566 -1.232592
H  -2.729329 4.064305 -2.189576
H  1.665092 1.031166 1.601398
H  0.952345 -1.251803 1.503921
H  3.660027 0.248836 -1.480092
H  3.959963 -2.038991 -2.343831
H  3.535398 -3.757804 1.725403
H  -0.073901 -5.976915 1.028513
H  4.508109 -5.704637 2.851185
H  0.910364 -7.924146 2.182604
H  3.212509 -7.80077 3.095589
elementType: Cl F O N C H
totalener: -2149.93897872 hartree
nucrepener: 2847.30666751 hartree
electener: -4997.24564623 hartree
oneelecener: -8607.54296371 hartree
twoeener: 3610.29731749 hartree
cpcmener: -0.03084319 hartree
kineticenergy: 2143.45677028 hartree
xcener: -159.156819056656 hartree
chargesum: -0.0000000
charge: -0.054567 -0.059980 -0.205295 -0.273896 -0.440837 -0.321951 -0.086434 0.092565 0.032766 -0.090532 -0.264835 -0.272466 -0.204806 0.402289 0.042226 0.389946 -0.022104 -0.220179 -0.154424 -0.155856 0.133018 -0.173999 0.276359 0.277585 -0.169387 -0.242509 -0.163679 -0.123119 -0.183466 0.079939 0.098432 0.091205 0.098849 0.101760 0.096709 0.100166 0.100248 0.129718 0.134581 0.138811 0.143509 0.153758 0.151276 0.145344 0.158861 0.157140 0.157263
qa: -0.0546 -0.0600 -0.2053 -0.2739 -0.4408 -0.3220 -0.0864 0.0926 0.0328 -0.0905 -0.2648 -0.2725 -0.2048 0.4023 0.0422 0.3899 -0.0221 -0.2202 -0.1544 -0.1559 0.1330 -0.1740 0.2764 0.2776 -0.1694 -0.2425 -0.1637 -0.1231 -0.1835 0.0799 0.0984 0.0912 0.0988 0.1018 0.0967 0.1002 0.1002 0.1297 0.1346 0.1388 0.1435 0.1538 0.1513 0.1453 0.1589 0.1571 0.1573
va: 1.2709 1.2446 1.0881 2.1237 2.0722 2.0746 3.1094 3.7332 3.8681 3.8492 3.9062 3.9084 3.8958 4.1994 4.2122 3.7352 3.7086 4.0736 3.9464 3.9558 3.7878 3.9303 3.9983 3.6831 3.8680 3.9898 3.9172 3.9014 3.9018 1.0476 1.0328 1.0060 1.0012 1.0009 1.0170 1.0012 0.9991 1.0185 1.0235 1.0242 1.0072 0.9983 1.0031 1.0089 0.9909 0.9891 0.9903
dispcorr: -0.023457939 hartree
energy: -2149.962436659008
dipole: 11.24703 -11.37673 -0.12970 -29.29698 27.97057 -1.32641 -3.01948 1.86301 -1.15647
magnitude: 1.76454 au
magnitude: 4.48511 debye
