program: Orca
programVersion: 5.0.2
elementType: Cl Cl F O O O N C C C C C C C C C C C C C C C C C C C C C C H H H H H H H H H H H H H H H H H H
charge: 0
multiplicity: 1
keywords: wb97x-d3
keywords: def2-TZVPP
keywords: def2/J RIJCOSX
keywords: DEFGRID2
keywords: scfconv7
keywords: smallprint printgap noloewdin
keywords: NOSOSCF
formula: C22H18Cl2FNO3
InChI: InChI=1/C22H18Cl2FNO3/c1-22(2)15(11-19(23)24)20(22)21(27)29-18(12-26)13-8-9-16(25)17(10-13)28-14-6-4-3-5-7-14/h3-11,15,18,20H,1-2H3
47 atoms
Cl -2.185411 -0.478114 0.468753
Cl -4.541928 0.326819 1.927188
F  2.232337 -2.996314 1.700317
O  1.080862 2.63119 -0.666259
O  1.489338 3.159306 1.461997
O  0.247584 -2.291797 -0.069446
N  2.878105 1.855583 -3.317204
C  -1.606673 4.013986 -0.439004
C  -1.774676 2.584413 -0.035372
C  -0.707832 3.448774 0.641322
C  -2.595415 5.048019 0.047718
C  -1.103628 4.311759 -1.831895
C  -2.91274 2.101801 0.760262
C  0.71616 3.089008 0.540463
C  -3.174484 0.823175 1.003946
C  2.364226 2.027878 -0.761025
C  2.369078 0.658053 -0.126902
C  2.639835 1.942191 -2.197202
C  1.360159 -0.24306 -0.450166
C  3.342758 0.313376 0.79635
C  1.307136 -1.476604 0.170085
C  3.313294 -0.934472 1.403029
C  2.292833 -1.806611 1.0964
C  0.442493 -3.577696 -0.500981
C  -0.570718 -4.480464 -0.209191
C  1.558766 -3.968151 -1.227138
C  -0.458248 -5.79192 -0.643351
C  1.659097 -5.287613 -1.64838
C  0.658666 -6.204213 -1.358776
H  -1.377033 1.866179 -0.743524
H  -0.950297 3.781703 1.643996
H  -2.885772 4.910542 1.088832
H  -2.162057 6.046052 -0.035472
H  -3.50151 5.029215 -0.560511
H  -0.468691 5.199143 -1.838241
H  -0.548464 3.492833 -2.281182
H  -1.956646 4.515642 -2.481384
H  -3.59502 2.829656 1.183144
H  3.140029 2.658768 -0.315018
H  0.595381 0.006582 -1.176019
H  4.124387 1.015417 1.055065
H  4.061344 -1.217193 2.131878
H  -1.436647 -4.154937 0.35397
H  2.343345 -3.263091 -1.473653
H  -1.247236 -6.496229 -0.413123
H  2.530333 -5.595314 -2.212093
H  0.74592 -7.230376 -1.690348
elementType: Cl F O N C H
totalener: -2149.93458254 hartree
nucrepener: 3061.22889814 hartree
electener: -5211.16348068 hartree
oneelecener: -9036.01443444 hartree
twoeener: 3824.85095376 hartree
cpcmener: -0.03256461 hartree
kineticenergy: 2143.47110952 hartree
xcener: -159.161061626144 hartree
chargesum: 0.0000000
charge: -0.054543 -0.060153 -0.206356 -0.278200 -0.433607 -0.318036 -0.084366 0.120045 -0.030343 -0.050957 -0.293302 -0.256984 -0.184356 0.371962 0.045950 0.390965 0.001503 -0.233330 -0.201998 -0.156344 0.140070 -0.153158 0.255057 0.280388 -0.249806 -0.171161 -0.123708 -0.155665 -0.184066 0.097812 0.098169 0.091917 0.101379 0.106516 0.102052 0.091108 0.095108 0.128543 0.141991 0.150493 0.148895 0.152418 0.141383 0.153431 0.157331 0.158571 0.157381
qa: -0.0545 -0.0602 -0.2064 -0.2782 -0.4336 -0.3180 -0.0844 0.1200 -0.0303 -0.0510 -0.2933 -0.2570 -0.1844 0.3720 0.0460 0.3910 0.0015 -0.2333 -0.2020 -0.1563 0.1401 -0.1532 0.2551 0.2804 -0.2498 -0.1712 -0.1237 -0.1557 -0.1841 0.0978 0.0982 0.0919 0.1014 0.1065 0.1021 0.0911 0.0951 0.1285 0.1420 0.1505 0.1489 0.1524 0.1414 0.1534 0.1573 0.1586 0.1574
va: 1.3043 1.2466 1.0861 2.1203 2.0784 2.0569 3.1067 3.7723 3.8888 3.8087 3.9273 3.8952 3.8671 4.2128 4.2230 3.7705 3.6369 4.0681 3.9949 3.9427 3.7476 3.9055 3.9969 3.6795 3.9932 3.8967 3.9014 3.9149 3.9001 1.0212 1.0269 1.0029 1.0010 0.9986 1.0009 1.0118 1.0004 1.0216 1.0142 1.0208 1.0005 0.9978 1.0120 1.0018 0.9895 0.9905 0.9904
dispcorr: -0.026883474 hartree
energy: -2149.961466009383
dipole: 4.70566 -4.99655 -0.29088 15.84573 -14.79592 1.04981 -12.53918 12.91238 0.37320
magnitude: 1.15152 au
magnitude: 2.92693 debye
