program: Orca
programVersion: 5.0.2
elementType: Cl Cl F O O O N C C C C C C C C C C C C C C C C C C C C C C H H H H H H H H H H H H H H H H H H
charge: 0
multiplicity: 1
keywords: wb97x-d3
keywords: def2-TZVPP
keywords: def2/J RIJCOSX
keywords: DEFGRID2
keywords: scfconv7
keywords: smallprint printgap noloewdin
keywords: NOSOSCF
formula: C22H18Cl2FNO3
InChI: InChI=1/C22H18Cl2FNO3/c1-22(2)15(11-19(23)24)20(22)21(27)29-18(12-26)13-8-9-16(25)17(10-13)28-14-6-4-3-5-7-14/h3-11,15,18,20H,1-2H3
47 atoms
Cl -2.085998 4.150987 0.526515
Cl -4.453279 5.062501 -0.854176
F  4.058737 -3.684189 -1.411882
O  0.777805 1.44352 -0.389221
O  -0.474004 0.221672 1.007696
O  2.742987 -3.639199 0.909669
N  3.492537 3.248329 0.089522
C  -2.531399 0.243919 -1.35562
C  -2.880329 1.328019 -0.397827
C  -1.462638 1.239748 -0.921997
C  -2.966015 0.375762 -2.795071
C  -2.510802 -1.180915 -0.861434
C  -3.721345 2.482496 -0.784389
C  -0.381225 0.892339 0.011166
C  -3.456868 3.729058 -0.421147
C  1.941653 1.167995 0.389074
C  2.593773 -0.109862 -0.070269
C  2.807625 2.334504 0.207021
C  2.403449 -1.262501 0.678804
C  3.297518 -0.16344 -1.268138
C  2.889603 -2.477769 0.222004
C  3.810129 -1.369201 -1.716232
C  3.589239 -2.51245 -0.976625
C  1.526599 -3.926746 1.478497
C  1.544087 -4.564304 2.709718
C  0.326051 -3.637799 0.841351
C  0.343631 -4.919542 3.308696
C  -0.865966 -3.988899 1.458588
C  -0.864832 -4.627655 2.691485
H  -2.998652 1.013439 0.636602
H  -1.187241 1.965371 -1.678371
H  -2.322776 -0.221632 -3.443323
H  -3.988626 0.015324 -2.922518
H  -2.927652 1.405238 -3.152754
H  -2.319307 -1.262051 0.205729
H  -3.480287 -1.644005 -1.053604
H  -1.75808 -1.768236 -1.390292
H  -4.613966 2.3029 -1.372994
H  1.699131 1.111285 1.45459
H  1.86731 -1.219381 1.618739
H  3.456679 0.728743 -1.860721
H  4.365107 -1.427197 -2.643602
H  2.488855 -4.783377 3.191572
H  0.309021 -3.149909 -0.125358
H  0.357593 -5.419391 4.268656
H  -1.80249 -3.763905 0.963884
H  -1.798927 -4.898732 3.16559
elementType: Cl F O N C H
totalener: -2149.93624942 hartree
nucrepener: 2985.90639810 hartree
electener: -5135.84264751 hartree
oneelecener: -8884.98760051 hartree
twoeener: 3749.14495300 hartree
cpcmener: -0.03067763 hartree
kineticenergy: 2143.47827132 hartree
xcener: -159.161435106972 hartree
chargesum: 0.0000000
charge: -0.049246 -0.054157 -0.206132 -0.271632 -0.449273 -0.327814 -0.086265 0.157892 -0.031605 -0.156872 -0.278495 -0.300112 -0.220064 0.419263 0.077137 0.396095 -0.032030 -0.222446 -0.135094 -0.179644 0.182052 -0.170302 0.210485 0.276488 -0.240546 -0.187543 -0.121930 -0.150004 -0.185188 0.115596 0.114397 0.099681 0.102196 0.094586 0.090820 0.100766 0.105202 0.140493 0.135880 0.149827 0.144300 0.152502 0.147470 0.159925 0.157765 0.167420 0.158155
qa: -0.0492 -0.0542 -0.2061 -0.2716 -0.4493 -0.3278 -0.0863 0.1579 -0.0316 -0.1569 -0.2785 -0.3001 -0.2201 0.4193 0.0771 0.3961 -0.0320 -0.2224 -0.1351 -0.1796 0.1821 -0.1703 0.2105 0.2765 -0.2405 -0.1875 -0.1219 -0.1500 -0.1852 0.1156 0.1144 0.0997 0.1022 0.0946 0.0908 0.1008 0.1052 0.1405 0.1359 0.1498 0.1443 0.1525 0.1475 0.1599 0.1578 0.1674 0.1582
va: 1.2823 1.2519 1.0877 2.1233 2.0569 2.0860 3.1109 3.6941 3.8731 3.8655 3.9151 3.8952 3.9067 4.1263 4.1854 3.7493 3.6894 4.0611 3.8895 3.9570 3.7295 3.8983 4.0799 3.7130 4.0012 3.8907 3.8935 3.8844 3.9272 1.0199 1.0239 1.0029 0.9999 0.9993 1.0136 1.0029 0.9947 1.0085 1.0185 1.0147 1.0066 0.9979 1.0066 0.9922 0.9886 0.9851 0.9912
dispcorr: -0.026492358 hartree
energy: -2149.962741773076
dipole: -8.46525 6.50793 -1.95732 -28.61263 27.29408 -1.31856 -2.48720 1.74255 -0.74464
magnitude: 2.47471 au
magnitude: 6.29021 debye
