program: Orca
programVersion: 5.0.2
elementType: Cl Cl F O O O N C C C C C C C C C C C C C C C C C C C C C C H H H H H H H H H H H H H H H H H H
charge: 0
multiplicity: 1
keywords: wb97x-d3
keywords: def2-TZVPP
keywords: def2/J RIJCOSX
keywords: DEFGRID2
keywords: scfconv7
keywords: smallprint printgap noloewdin
keywords: NOSOSCF
formula: C22H18Cl2FNO3
InChI: InChI=1/C22H18Cl2FNO3/c1-22(2)15(11-19(23)24)20(22)21(27)29-18(12-26)13-8-9-16(25)17(10-13)28-14-6-4-3-5-7-14/h3-11,15,18,20H,1-2H3
47 atoms
Cl -2.262652 4.169453 0.958094
Cl -4.58228 5.106925 -0.486624
F  3.8858 -3.63229 -1.757607
O  0.854779 1.53736 -0.221564
O  -0.459982 0.320619 1.120841
O  2.666604 -3.736109 0.614504
N  3.712751 3.094433 0.404973
C  -2.395952 0.449051 -1.352926
C  -2.829445 1.428978 -0.319674
C  -1.389103 1.442188 -0.779506
C  -2.770993 0.688346 -2.795007
C  -2.337428 -1.012687 -0.98416
C  -3.704403 2.577593 -0.6435
C  -0.33098 1.023669 0.151422
C  -3.539203 3.787035 -0.127708
C  2.005354 1.121729 0.510926
C  2.575603 -0.140418 -0.082656
C  2.951835 2.23519 0.435519
C  2.37929 -1.343283 0.57949
C  3.224308 -0.116916 -1.313445
C  2.816814 -2.529185 0.008847
C  3.683306 -1.294652 -1.877547
C  3.464803 -2.486755 -1.217037
C  1.433123 -4.070615 1.115711
C  0.253289 -3.718829 0.471639
C  1.411414 -4.817037 2.284376
C  -0.958507 -4.114971 1.01947
C  0.191921 -5.213815 2.814222
C  -0.996997 -4.858838 2.191105
H  -2.981717 1.016532 0.675096
H  -1.105056 2.239046 -1.457128
H  -2.766662 1.745497 -3.062527
H  -2.070986 0.178932 -3.459432
H  -3.768087 0.294971 -3.002517
H  -1.551323 -1.526102 -1.541254
H  -2.16912 -1.181387 0.076745
H  -3.285484 -1.488239 -1.24285
H  -4.542488 2.422383 -1.313583
H  1.768568 0.97346 1.568636
H  1.880875 -1.364519 1.541143
H  3.384191 0.815653 -1.840472
H  4.195601 -1.2920 -2.831099
H  0.267159 -3.146255 -0.44765
H  2.340833 -5.084585 2.771833
H  -1.878513 -3.840291 0.518656
H  0.175067 -5.795914 3.726633
H  -1.945919 -5.162222 2.613361
elementType: Cl F O N C H
totalener: -2149.93667088 hartree
nucrepener: 2980.85860258 hartree
electener: -5130.79527346 hartree
oneelecener: -8874.77091997 hartree
twoeener: 3743.97564652 hartree
cpcmener: -0.03104626 hartree
kineticenergy: 2143.47220898 hartree
xcener: -159.159954084841 hartree
chargesum: -0.0000000
charge: -0.049335 -0.054518 -0.205911 -0.274522 -0.446205 -0.329465 -0.086603 0.156159 -0.033572 -0.153223 -0.280418 -0.300272 -0.214801 0.414937 0.072498 0.404736 -0.029746 -0.225642 -0.126470 -0.179232 0.169493 -0.175205 0.218775 0.260781 -0.173916 -0.233169 -0.158518 -0.125675 -0.180444 0.115354 0.112994 0.094521 0.100567 0.102580 0.105066 0.092316 0.102064 0.140403 0.133244 0.150104 0.146510 0.152650 0.160431 0.147340 0.167996 0.157469 0.157873
qa: -0.0493 -0.0545 -0.2059 -0.2745 -0.4462 -0.3295 -0.0866 0.1562 -0.0336 -0.1532 -0.2804 -0.3003 -0.2148 0.4149 0.0725 0.4047 -0.0297 -0.2256 -0.1265 -0.1792 0.1695 -0.1752 0.2188 0.2608 -0.1739 -0.2332 -0.1585 -0.1257 -0.1804 0.1154 0.1130 0.0945 0.1006 0.1026 0.1051 0.0923 0.1021 0.1404 0.1332 0.1501 0.1465 0.1526 0.1604 0.1473 0.1680 0.1575 0.1579
va: 1.2813 1.2516 1.0881 2.1259 2.0619 2.0822 3.1113 3.7063 3.8789 3.8615 3.9132 3.8942 3.9002 4.1421 4.1897 3.7353 3.6864 4.0679 3.8915 3.9549 3.7348 3.9017 4.0780 3.7262 3.8753 3.9943 3.8884 3.8990 3.9202 1.0206 1.0246 0.9997 1.0030 0.9997 0.9948 1.0130 1.0027 1.0082 1.0206 1.0135 1.0057 0.9978 0.9926 1.0066 0.9852 0.9887 0.9909
dispcorr: -0.026452243 hartree
energy: -2149.963123117959
dipole: -6.90804 4.98495 -1.92310 -28.07352 26.83827 -1.23526 -5.50259 4.50273 -0.99987
magnitude: 2.49478 au
magnitude: 6.34122 debye
