program: Orca
programVersion: 5.0.2
elementType: Cl Cl F O O O N C C C C C C C C C C C C C C C C C C C C C C H H H H H H H H H H H H H H H H H H
charge: 0
multiplicity: 1
keywords: wb97x-d3
keywords: def2-TZVPP
keywords: def2/J RIJCOSX
keywords: DEFGRID2
keywords: scfconv7
keywords: smallprint printgap noloewdin
keywords: NOSOSCF
formula: C22H18Cl2FNO3
InChI: InChI=1/C22H18Cl2FNO3/c1-22(2)15(11-19(23)24)20(22)21(27)29-18(12-26)13-8-9-16(25)17(10-13)28-14-6-4-3-5-7-14/h3-11,15,18,20H,1-2H3
47 atoms
Cl -2.784008 -0.443104 -0.51585
Cl -4.769207 0.168743 1.482113
F  2.950196 -2.994676 1.661828
O  1.027283 2.513737 -0.624233
O  1.48856 3.088553 1.480814
O  0.500035 -2.257005 0.715185
N  2.759111 1.819332 -3.344295
C  -1.625345 3.98843 -0.285045
C  -1.810354 2.519872 -0.049547
C  -0.744962 3.287325 0.728932
C  -2.608208 4.978036 0.295709
C  -1.091349 4.428362 -1.627465
C  -2.949112 1.966761 0.692823
C  0.68721 2.974922 0.589486
C  -3.429321 0.736334 0.560171
C  2.343937 2.01286 -0.771961
C  2.510175 0.658695 -0.119352
C  2.557948 1.914239 -2.21753
C  1.43517 -0.219967 -0.059472
C  3.739734 0.292723 0.405933
C  1.582238 -1.447692 0.557395
C  3.90268 -0.951034 0.999045
C  2.82257 -1.802692 1.0745
C  0.451708 -3.462836 0.067373
C  -0.442781 -4.393901 0.579604
C  1.209879 -3.750111 -1.058849
C  -0.576467 -5.623855 -0.043927
C  1.066625 -4.990251 -1.668737
C  0.178893 -5.931091 -1.168892
H  -1.425743 1.889583 -0.842553
H  -0.990944 3.509597 1.760996
H  -3.50021 5.043469 -0.32973
H  -2.924702 4.730134 1.30825
H  -2.157087 5.970971 0.334832
H  -1.927825 4.703398 -2.272448
H  -0.455236 5.309162 -1.523376
H  -0.525284 3.660089 -2.148028
H  -3.437762 2.600907 1.422824
H  3.088172 2.713443 -0.378583
H  0.466446 0.037736 -0.469333
H  4.577448 0.977271 0.364534
H  4.855621 -1.247343 1.417649
H  -1.027375 -4.152451 1.458657
H  1.899264 -3.025388 -1.474153
H  -1.273429 -6.348091 0.357921
H  1.656825 -5.214479 -2.54794
H  0.074179 -6.893773 -1.651435
elementType: Cl F O N C H
totalener: -2149.93584673 hartree
nucrepener: 3034.19444212 hartree
electener: -5184.13028884 hartree
oneelecener: -8981.79749515 hartree
twoeener: 3797.66720631 hartree
cpcmener: -0.03394810 hartree
kineticenergy: 2143.46626354 hartree
xcener: -159.160548544999 hartree
chargesum: -0.0000000
charge: -0.059579 -0.059166 -0.206763 -0.281960 -0.428908 -0.317981 -0.085199 0.094807 0.012136 -0.052109 -0.280425 -0.259967 -0.202491 0.374632 0.052524 0.367142 -0.015394 -0.226860 -0.112766 -0.160093 0.094292 -0.167522 0.281298 0.279456 -0.246736 -0.172092 -0.120029 -0.160742 -0.183475 0.091991 0.096671 0.103354 0.092645 0.100373 0.096044 0.102038 0.092517 0.128159 0.146454 0.123988 0.148787 0.152413 0.143393 0.152686 0.156480 0.158662 0.157314
qa: -0.0596 -0.0592 -0.2068 -0.2820 -0.4289 -0.3180 -0.0852 0.0948 0.0121 -0.0521 -0.2804 -0.2600 -0.2025 0.3746 0.0525 0.3671 -0.0154 -0.2269 -0.1128 -0.1601 0.0943 -0.1675 0.2813 0.2795 -0.2467 -0.1721 -0.1200 -0.1607 -0.1835 0.0920 0.0967 0.1034 0.0926 0.1004 0.0960 0.1020 0.0925 0.1282 0.1465 0.1240 0.1488 0.1524 0.1434 0.1527 0.1565 0.1587 0.1573
va: 1.2715 1.2461 1.0867 2.1066 2.0801 2.0705 3.1086 3.7602 3.8596 3.8123 3.9207 3.9082 3.8902 4.2016 4.2110 3.7530 3.6726 4.0582 3.9592 3.9448 3.8408 3.9128 3.9891 3.6607 3.9952 3.8729 3.8949 3.9138 3.8996 1.0286 1.0277 0.9999 1.0057 1.0004 1.0001 1.0004 1.0106 1.0220 1.0156 1.0202 0.9985 0.9976 1.0103 1.0034 0.9892 0.9907 0.9902
dispcorr: -0.026047296 hartree
energy: -2149.961894021277
dipole: 5.15343 -5.36345 -0.21002 16.80099 -15.51333 1.28766 -7.98580 8.38710 0.40130
magnitude: 1.36500 au
magnitude: 3.46956 debye
