program: Orca
programVersion: 5.0.2
elementType: Cl Cl F O O O N C C C C C C C C C C C C C C C C C C C C C C H H H H H H H H H H H H H H H H H H
charge: 0
multiplicity: 1
keywords: wb97x-d3
keywords: def2-TZVPP
keywords: def2/J RIJCOSX
keywords: DEFGRID2
keywords: scfconv7
keywords: smallprint printgap noloewdin
keywords: NOSOSCF
formula: C22H18Cl2FNO3
InChI: InChI=1/C22H18Cl2FNO3/c1-22(2)15(11-19(23)24)20(22)21(27)29-18(12-26)13-8-9-16(25)17(10-13)28-14-6-4-3-5-7-14/h3-11,15,18,20H,1-2H3
47 atoms
Cl -1.477424 2.019118 -3.845887
Cl -4.313685 1.521444 -4.008178
F  2.278598 -3.689232 -1.465495
O  0.389573 1.910352 0.512206
O  -0.664092 0.529984 1.913913
O  2.565713 -3.477528 1.168701
N  3.434663 3.055714 0.056833
C  -2.259811 3.452707 0.417546
C  -2.037531 2.627979 -0.814122
C  -1.962763 1.972383 0.558422
C  -3.658524 3.869406 0.80486
C  -1.227564 4.497888 0.767747
C  -3.124851 2.237834 -1.718802
C  -0.709695 1.394642 1.076101
C  -2.982586 1.965711 -3.010059
C  1.641032 1.345078 0.883077
C  1.848989 -0.003745 0.240791
C  2.637269 2.309602 0.411635
C  2.122957 -1.104438 1.037534
C  1.729483 -0.142539 -1.137047
C  2.264672 -2.358386 0.462073
C  1.883554 -1.388971 -1.718793
C  2.139745 -2.480806 -0.915084
C  1.927992 -3.745342 2.352668
C  2.651066 -4.474786 3.286278
C  0.616773 -3.364164 2.608554
C  2.055583 -4.822504 4.489457
C  0.039723 -3.711009 3.822759
C  0.751272 -4.436716 4.767518
H  -1.078793 2.788226 -1.292059
H  -2.818219 1.371731 0.846167
H  -4.398037 3.081726 0.665285
H  -3.685348 4.152851 1.858422
H  -3.975114 4.735658 0.220994
H  -1.136293 4.605698 1.850169
H  -0.239851 4.290878 0.363242
H  -1.542034 5.463478 0.367834
H  -4.124941 2.152456 -1.310911
H  1.73892 1.272185 1.970803
H  2.218019 -0.988596 2.110498
H  1.514813 0.712188 -1.766496
H  1.794386 -1.518011 -2.789562
H  3.669802 -4.770674 3.068199
H  0.041302 -2.803501 1.882643
H  2.621535 -5.391443 5.215764
H  -0.98032 -3.410204 4.024424
H  0.29228 -4.701863 5.710897
elementType: Cl F O N C H
totalener: -2149.93653288 hartree
nucrepener: 2949.38904401 hartree
electener: -5099.32557689 hartree
oneelecener: -8811.72325636 hartree
twoeener: 3712.39767947 hartree
cpcmener: -0.03256811 hartree
kineticenergy: 2143.46886564 hartree
xcener: -159.161689426479 hartree
chargesum: 0.0000000
charge: -0.057489 -0.058847 -0.206209 -0.272157 -0.438629 -0.325021 -0.084053 0.087671 0.034202 -0.075928 -0.279838 -0.259248 -0.210712 0.403335 0.049786 0.378254 -0.004312 -0.229214 -0.173164 -0.184412 0.206383 -0.175391 0.213307 0.295177 -0.254625 -0.190502 -0.115474 -0.144486 -0.190088 0.085338 0.098956 0.092927 0.098881 0.103758 0.101333 0.093161 0.096743 0.127633 0.140019 0.152372 0.146562 0.150609 0.145861 0.152440 0.157768 0.159314 0.158009
qa: -0.0575 -0.0588 -0.2062 -0.2722 -0.4386 -0.3250 -0.0841 0.0877 0.0342 -0.0759 -0.2798 -0.2592 -0.2107 0.4033 0.0498 0.3783 -0.0043 -0.2292 -0.1732 -0.1844 0.2064 -0.1754 0.2133 0.2952 -0.2546 -0.1905 -0.1155 -0.1445 -0.1901 0.0853 0.0990 0.0929 0.0989 0.1038 0.1013 0.0932 0.0967 0.1276 0.1400 0.1524 0.1466 0.1506 0.1459 0.1524 0.1578 0.1593 0.1580
va: 1.2697 1.2464 1.0874 2.1270 2.0723 2.0884 3.1066 3.7570 3.8390 3.8369 3.9187 3.9079 3.8977 4.1814 4.2163 3.7711 3.6283 4.0670 3.9261 3.9265 3.7074 3.9035 4.0724 3.6939 4.0044 3.8943 3.8843 3.8977 3.9132 1.0378 1.0271 1.0056 1.0009 0.9994 1.0002 1.0100 1.0002 1.0220 1.0170 1.0040 1.0087 0.9985 1.0082 1.0038 0.9890 0.9906 0.9905
dispcorr: -0.024940416 hartree
energy: -2149.961473295482
dipole: -3.40625 1.68760 -1.71865 8.52493 -7.83600 0.68893 33.54361 -32.27990 1.26371
magnitude: 2.24173 au
magnitude: 5.69802 debye
