program: Orca
programVersion: 5.0.2
elementType: Cl Cl F O O O N C C C C C C C C C C C C C C C C C C C C C C H H H H H H H H H H H H H H H H H H
charge: 0
multiplicity: 1
keywords: wb97x-d3
keywords: def2-TZVPP
keywords: def2/J RIJCOSX
keywords: DEFGRID2
keywords: scfconv7
keywords: smallprint printgap noloewdin
keywords: NOSOSCF
formula: C22H18Cl2FNO3
InChI: InChI=1/C22H18Cl2FNO3/c1-22(2)15(11-19(23)24)20(22)21(27)29-18(12-26)13-8-9-16(25)17(10-13)28-14-6-4-3-5-7-14/h3-11,15,18,20H,1-2H3
47 atoms
Cl -4.53112 4.46192 1.223014
Cl -4.121529 6.499426 -0.775669
F  2.147116 -4.510676 -1.481363
O  0.843912 1.492877 -0.357644
O  -0.861281 0.760783 0.889637
O  1.095246 -4.076877 0.992102
N  4.047345 1.968472 0.307391
C  -2.563664 1.609094 -1.587645
C  -2.619379 2.713428 -0.573726
C  -1.273416 2.162237 -1.01206
C  -2.809774 1.910976 -3.046221
C  -3.081098 0.252607 -1.175626
C  -2.966362 4.090349 -0.945006
C  -0.462013 1.398364 -0.049978
C  -3.760973 4.89768 -0.253668
C  1.750043 0.731591 0.435085
C  1.874398 -0.680584 -0.079133
C  3.029778 1.438071 0.350576
C  1.464138 -1.742114 0.71657
C  2.374004 -0.917433 -1.354429
C  1.554074 -3.038743 0.240218
C  2.469556 -2.212091 -1.836405
C  2.057722 -3.256077 -1.035429
C  1.987172 -4.999751 1.474346
C  3.349496 -4.756236 1.576973
C  1.447979 -6.208688 1.895746
C  4.174794 -5.746194 2.095643
C  2.285106 -7.182917 2.415438
C  3.652889 -6.960412 2.51446
H  -2.935077 2.398755 0.414525
H  -0.700325 2.782823 -1.691319
H  -2.417549 1.102349 -3.66533
H  -3.880111 1.989978 -3.245148
H  -2.337069 2.833282 -3.381741
H  -2.505656 -0.546742 -1.645727
H  -3.068924 0.091926 -0.100534
H  -4.115709 0.149132 -1.507251
H  -2.545761 4.490182 -1.860004
H  1.451229 0.727695 1.487476
H  1.070112 -1.570392 1.710972
H  2.69836 -0.09787 -1.983696
H  2.859425 -2.410745 -2.826125
H  3.778479 -3.81108 1.268709
H  0.382286 -6.382366 1.813129
H  5.237555 -5.556205 2.173016
H  1.862815 -8.125254 2.739767
H  4.303785 -7.725762 2.91572
elementType: Cl F O N C H
totalener: -2149.93950221 hartree
nucrepener: 2831.81258781 hartree
electener: -4981.75209002 hartree
oneelecener: -8576.71036529 hartree
twoeener: 3594.95827527 hartree
cpcmener: -0.03191464 hartree
kineticenergy: 2143.46441213 hartree
xcener: -159.158154034910 hartree
chargesum: -0.0000000
charge: -0.054831 -0.059160 -0.205374 -0.281516 -0.446124 -0.323400 -0.087173 0.090235 0.033284 -0.087571 -0.265417 -0.269852 -0.201414 0.402031 0.041143 0.411426 -0.024608 -0.226942 -0.146235 -0.167745 0.125167 -0.178613 0.279470 0.276128 -0.167459 -0.239027 -0.167303 -0.124633 -0.182401 0.082615 0.096811 0.099339 0.101509 0.091016 0.101113 0.095832 0.098519 0.129643 0.135622 0.140461 0.151527 0.153729 0.151212 0.145701 0.158613 0.156744 0.157905
qa: -0.0548 -0.0592 -0.2054 -0.2815 -0.4461 -0.3234 -0.0872 0.0902 0.0333 -0.0876 -0.2654 -0.2699 -0.2014 0.4020 0.0411 0.4114 -0.0246 -0.2269 -0.1462 -0.1677 0.1252 -0.1786 0.2795 0.2761 -0.1675 -0.2390 -0.1673 -0.1246 -0.1824 0.0826 0.0968 0.0993 0.1015 0.0910 0.1011 0.0958 0.0985 0.1296 0.1356 0.1405 0.1515 0.1537 0.1512 0.1457 0.1586 0.1567 0.1579
va: 1.2709 1.2458 1.0882 2.1329 2.0680 2.0766 3.1110 3.7188 3.8719 3.8649 3.9106 3.9055 3.8974 4.1804 4.2130 3.7204 3.6368 4.0797 3.9841 3.9474 3.8037 3.9306 4.0022 3.6844 3.8621 3.9874 3.9212 3.9023 3.8996 1.0452 1.0337 1.0011 1.0006 1.0059 0.9989 1.0182 1.0003 1.0183 1.0188 1.0185 1.0054 0.9983 1.0035 1.0086 0.9910 0.9893 0.9902
dispcorr: -0.023202918 hartree
energy: -2149.962705130093
dipole: 9.63727 -10.04603 -0.40876 -27.86641 27.09903 -0.76738 -6.68801 5.39779 -1.29021
magnitude: 1.55583 au
magnitude: 3.95460 debye
