program: Orca
programVersion: 5.0.2
elementType: Cl Cl F O O O N C C C C C C C C C C C C C C C C C C C C C C H H H H H H H H H H H H H H H H H H
charge: 0
multiplicity: 1
keywords: wb97x-d3
keywords: def2-TZVPP
keywords: def2/J RIJCOSX
keywords: DEFGRID2
keywords: scfconv7
keywords: smallprint printgap noloewdin
keywords: NOSOSCF
formula: C22H18Cl2FNO3
InChI: InChI=1/C22H18Cl2FNO3/c1-22(2)15(11-19(23)24)20(22)21(27)29-18(12-26)13-8-9-16(25)17(10-13)28-14-6-4-3-5-7-14/h3-11,15,18,20H,1-2H3
47 atoms
Cl -1.389084 1.466902 -3.669589
Cl -4.252794 1.189385 -3.875708
F  2.219974 -3.582947 -1.499876
O  0.474066 2.02676 0.536391
O  -0.571195 0.662699 1.959834
O  2.52362 -3.400165 1.138812
N  3.528382 3.144989 0.074728
C  -2.19183 3.537149 0.361691
C  -1.980215 2.64655 -0.823178
C  -1.882089 2.069588 0.584272
C  -3.587928 3.959935 0.751053
C  -1.164711 4.609858 0.633498
C  -3.074071 2.194842 -1.691672
C  -0.622871 1.514244 1.108891
C  -2.918046 1.6884 -2.908593
C  1.722618 1.445742 0.895859
C  1.905235 0.098559 0.241531
C  2.727303 2.403347 0.430228
C  2.147846 -1.017339 1.026808
C  1.781398 -0.0245 -1.13747
C  2.253662 -2.268589 0.438115
C  1.896777 -1.268837 -1.732315
C  2.120957 -2.375535 -0.939151
C  1.821647 -3.687504 2.281029
C  2.479211 -4.46416 3.225491
C  0.510866 -3.276136 2.487389
C  1.818726 -4.827697 4.389205
C  -0.132238 -3.640994 3.662486
C  0.513212 -4.413921 4.617219
H  -1.027247 2.781525 -1.320852
H  -2.730972 1.481557 0.913772
H  -3.598535 4.297592 1.788664
H  -3.92618 4.790461 0.128862
H  -4.32017 3.157467 0.66824
H  -1.047406 4.774431 1.706158
H  -0.185387 4.39327 0.213956
H  -1.502122 5.549659 0.193206
H  -4.089175 2.264613 -1.319507
H  1.825735 1.362086 1.982229
H  2.245093 -0.917096 2.101214
H  1.594121 0.842993 -1.75761
H  1.800859 -1.38399 -2.80405
H  3.498866 -4.78195 3.046884
H  -0.014724 -2.678699 1.753011
H  2.334095 -5.433563 5.123258
H  -1.152031 -3.316882 3.825146
H  0.002924 -4.692992 5.529465
elementType: Cl F O N C H
totalener: -2149.93617358 hartree
nucrepener: 2969.88558383 hartree
electener: -5119.82175740 hartree
oneelecener: -8852.73607243 hartree
twoeener: 3732.91431503 hartree
cpcmener: -0.03251577 hartree
kineticenergy: 2143.47155469 hartree
xcener: -159.161938339060 hartree
chargesum: -0.0000000
charge: -0.057682 -0.058213 -0.205933 -0.272947 -0.439031 -0.326158 -0.083989 0.094925 0.008204 -0.066342 -0.286172 -0.258422 -0.194550 0.399863 0.044849 0.378357 -0.002805 -0.229617 -0.166578 -0.185179 0.198436 -0.177014 0.218360 0.292175 -0.253590 -0.184851 -0.117026 -0.147885 -0.189530 0.089805 0.099840 0.099816 0.105228 0.093294 0.101676 0.092687 0.096765 0.127836 0.139313 0.151919 0.147736 0.150011 0.146133 0.151059 0.157939 0.159384 0.157902
qa: -0.0577 -0.0582 -0.2059 -0.2729 -0.4390 -0.3262 -0.0840 0.0949 0.0082 -0.0663 -0.2862 -0.2584 -0.1945 0.3999 0.0448 0.3784 -0.0028 -0.2296 -0.1666 -0.1852 0.1984 -0.1770 0.2184 0.2922 -0.2536 -0.1849 -0.1170 -0.1479 -0.1895 0.0898 0.0998 0.0998 0.1052 0.0933 0.1017 0.0927 0.0968 0.1278 0.1393 0.1519 0.1477 0.1500 0.1461 0.1511 0.1579 0.1594 0.1579
va: 1.2718 1.2472 1.0881 2.1284 2.0712 2.0867 3.1067 3.7740 3.8541 3.8205 3.9213 3.9037 3.8795 4.1850 4.2178 3.7768 3.6262 4.0667 3.9283 3.9213 3.7086 3.9061 4.0768 3.6962 4.0018 3.8863 3.8873 3.9001 3.9116 1.0339 1.0267 1.0009 0.9991 1.0048 1.0003 1.0102 1.0002 1.0224 1.0171 1.0046 1.0090 0.9992 1.0080 1.0051 0.9889 0.9908 0.9904
dispcorr: -0.025354921 hartree
energy: -2149.961528496255
dipole: -3.89579 2.13618 -1.75961 11.16788 -10.33062 0.83725 31.99179 -30.86536 1.12642
magnitude: 2.25079 au
magnitude: 5.72105 debye
