program: Orca
programVersion: 5.0.2
elementType: Cl Cl F O O O N C C C C C C C C C C C C C C C C C C C C C C H H H H H H H H H H H H H H H H H H
charge: 0
multiplicity: 1
keywords: wb97x-d3
keywords: def2-TZVPP
keywords: def2/J RIJCOSX
keywords: DEFGRID2
keywords: scfconv7
keywords: smallprint printgap noloewdin
keywords: NOSOSCF
formula: C22H18Cl2FNO3
InChI: InChI=1/C22H18Cl2FNO3/c1-22(2)15(11-19(23)24)20(22)21(27)29-18(12-26)13-8-9-16(25)17(10-13)28-14-6-4-3-5-7-14/h3-11,15,18,20H,1-2H3
47 atoms
Cl -1.348161 1.348134 -3.611609
Cl -4.21158 1.088306 -3.84123
F  2.187703 -3.539746 -1.550546
O  0.49314 2.047176 0.561112
O  -0.546205 0.67636 1.982767
O  2.442646 -3.40133 1.089132
N  3.541954 3.175525 0.090062
C  -2.174149 3.538349 0.353597
C  -1.958007 2.627498 -0.814437
C  -1.862621 2.075673 0.604078
C  -3.573403 3.9656 0.727991
C  -1.151256 4.618408 0.612703
C  -3.047973 2.158895 -1.679211
C  -0.601045 1.528654 1.132745
C  -2.883646 1.611867 -2.877301
C  1.744933 1.463741 0.905337
C  1.922008 0.12462 0.234015
C  2.744964 2.427863 0.44251
C  2.123224 -1.007218 1.0085
C  1.827134 0.02395 -1.149269
C  2.212164 -2.252544 0.4047
C  1.927477 -1.214469 -1.759053
C  2.106445 -2.336942 -0.976739
C  1.757274 -3.671154 2.245047
C  2.413834 -4.465009 3.175531
C  0.460328 -3.229731 2.476114
C  1.766682 -4.815777 4.350728
C  -0.168702 -3.580616 3.662946
C  0.476321 -4.37058 4.604159
H  -1.002857 2.752358 -1.310739
H  -2.710587 1.491183 0.942347
H  -4.303108 3.159471 0.660597
H  -3.589462 4.327825 1.757166
H  -3.910614 4.780407 0.084807
H  -1.036449 4.796285 1.683452
H  -0.170667 4.400545 0.197304
H  -1.491891 5.551342 0.16092
H  -4.066295 2.249363 -1.320435
H  1.85632 1.368592 1.990026
H  2.201018 -0.92195 2.085634
H  1.674171 0.904286 -1.760905
H  1.853969 -1.312655 -2.834304
H  3.422066 -4.806611 2.976796
H  -0.065002 -2.620004 1.751674
H  2.281063 -5.43534 5.073937
H  -1.177406 -3.233016 3.845195
H  -0.022985 -4.639537 5.52547
elementType: Cl F O N C H
totalener: -2149.93593403 hartree
nucrepener: 2977.89067996 hartree
electener: -5127.82661399 hartree
oneelecener: -8868.76947662 hartree
twoeener: 3740.94286263 hartree
cpcmener: -0.03235333 hartree
kineticenergy: 2143.47001285 hartree
xcener: -159.161821899662 hartree
chargesum: -0.0000000
charge: -0.058032 -0.058161 -0.206048 -0.272159 -0.439605 -0.325269 -0.084415 0.096134 0.003930 -0.063274 -0.287467 -0.258179 -0.193554 0.398846 0.045276 0.378330 -0.000768 -0.230062 -0.170397 -0.193444 0.207525 -0.172822 0.213374 0.295463 -0.255576 -0.189417 -0.115816 -0.145039 -0.190182 0.090946 0.099988 0.093312 0.099922 0.105531 0.101682 0.092677 0.096632 0.128025 0.138914 0.151516 0.148330 0.150193 0.146159 0.151536 0.158004 0.159530 0.157912
qa: -0.0580 -0.0582 -0.2060 -0.2722 -0.4396 -0.3253 -0.0844 0.0961 0.0039 -0.0633 -0.2875 -0.2582 -0.1936 0.3988 0.0453 0.3783 -0.0008 -0.2301 -0.1704 -0.1934 0.2075 -0.1728 0.2134 0.2955 -0.2556 -0.1894 -0.1158 -0.1450 -0.1902 0.0909 0.1000 0.0933 0.0999 0.1055 0.1017 0.0927 0.0966 0.1280 0.1389 0.1515 0.1483 0.1502 0.1462 0.1515 0.1580 0.1595 0.1579
va: 1.2718 1.2473 1.0878 2.1285 2.0705 2.0883 3.1065 3.7754 3.8558 3.8188 3.9221 3.9026 3.8783 4.1852 4.2175 3.7805 3.6239 4.0652 3.9263 3.9231 3.7038 3.9031 4.0776 3.6943 4.0051 3.8916 3.8851 3.8977 3.9133 1.0333 1.0263 1.0047 1.0009 0.9989 1.0003 1.0104 1.0002 1.0223 1.0166 1.0054 1.0089 0.9992 1.0081 1.0052 0.9889 0.9907 0.9905
dispcorr: -0.025507441 hartree
energy: -2149.961441472171
dipole: -3.97367 2.23971 -1.73396 11.78325 -10.93950 0.84375 31.67958 -30.56069 1.11889
magnitude: 2.22945 au
magnitude: 5.66681 debye
