program: Orca
programVersion: 5.0.2
elementType: Cl Cl F O O O N C C C C C C C C C C C C C C C C C C C C C C H H H H H H H H H H H H H H H H H H
charge: 0
multiplicity: 1
keywords: wb97x-d3
keywords: def2-TZVPP
keywords: def2/J RIJCOSX
keywords: DEFGRID2
keywords: scfconv7
keywords: smallprint printgap noloewdin
keywords: NOSOSCF
formula: C22H18Cl2FNO3
InChI: InChI=1/C22H18Cl2FNO3/c1-22(2)15(11-19(23)24)20(22)21(27)29-18(12-26)13-8-9-16(25)17(10-13)28-14-6-4-3-5-7-14/h3-11,15,18,20H,1-2H3
47 atoms
Cl -3.312151 5.452003 0.862351
Cl -5.003017 5.186868 -1.461216
F  3.889435 -3.329227 1.905963
O  0.666007 0.943888 -1.374377
O  0.603881 2.031041 0.578119
O  2.486534 -3.883586 -0.372077
N  2.936277 0.586721 -3.747362
C  -2.415496 1.119852 0.490744
C  -2.298657 2.565045 0.102406
C  -1.430279 1.529643 -0.588124
C  -3.598994 0.305747 0.025072
C  -1.935214 0.726044 1.86577
C  -3.327112 3.246883 -0.693281
C  0.024412 1.54991 -0.360794
C  -3.808193 4.460431 -0.45504
C  2.086115 0.889741 -1.295223
C  2.565999 -0.243791 -0.424162
C  2.543562 0.714994 -2.675988
C  2.255342 -1.557161 -0.765272
C  3.301575 0.023756 0.719718
C  2.704375 -2.600124 0.021362
C  3.749229 -1.017801 1.520396
C  3.451857 -2.312435 1.160001
C  1.796321 -4.741361 0.444692
C  0.867962 -4.309206 1.38141
C  2.043528 -6.095107 0.258768
C  0.191481 -5.253096 2.143802
C  1.355222 -7.023611 1.023426
C  0.429561 -6.6089 1.972672
H  -1.779163 3.181473 0.827658
H  -1.721535 1.255048 -1.595685
H  -3.889608 0.517201 -1.003435
H  -3.366946 -0.759169 0.08467
H  -4.465465 0.49173 0.66264
H  -1.164185 1.383751 2.260589
H  -2.774446 0.754894 2.563292
H  -1.543847 -0.293321 1.864508
H  -3.72487 2.726524 -1.556576
H  2.496232 1.839014 -0.936593
H  1.680882 -1.78605 -1.655796
H  3.539281 1.044161 0.99036
H  4.332295 -0.824837 2.411414
H  0.657592 -3.255681 1.520781
H  2.77047 -6.414251 -0.477765
H  -0.531563 -4.917659 2.876146
H  1.551958 -8.078244 0.879107
H  -0.101649 -7.336665 2.571853
elementType: Cl F O N C H
totalener: -2149.93961055 hartree
nucrepener: 2870.03060089 hartree
electener: -5019.97021144 hartree
oneelecener: -8652.98042425 hartree
twoeener: 3633.01021281 hartree
cpcmener: -0.03227356 hartree
kineticenergy: 2143.45761308 hartree
xcener: -159.156860699440 hartree
chargesum: -0.0000000
charge: -0.054781 -0.059073 -0.206143 -0.282278 -0.443570 -0.321071 -0.086624 0.086006 0.035425 -0.088923 -0.260386 -0.267631 -0.203394 0.398988 0.038709 0.421512 -0.030651 -0.230935 -0.179566 -0.135203 0.126528 -0.170502 0.268414 0.268914 -0.170750 -0.240113 -0.162118 -0.122727 -0.181366 0.082910 0.097030 0.090395 0.098957 0.101691 0.095612 0.099318 0.099933 0.131559 0.137683 0.141162 0.148132 0.152878 0.159550 0.145033 0.157272 0.156753 0.157437
qa: -0.0548 -0.0591 -0.2061 -0.2823 -0.4436 -0.3211 -0.0866 0.0860 0.0354 -0.0889 -0.2604 -0.2676 -0.2034 0.3990 0.0387 0.4215 -0.0307 -0.2309 -0.1796 -0.1352 0.1265 -0.1705 0.2684 0.2689 -0.1707 -0.2401 -0.1621 -0.1227 -0.1814 0.0829 0.0970 0.0904 0.0990 0.1017 0.0956 0.0993 0.0999 0.1316 0.1377 0.1412 0.1481 0.1529 0.1596 0.1450 0.1573 0.1568 0.1574
va: 1.2703 1.2458 1.0853 2.1344 2.0721 2.0766 3.1122 3.7355 3.8620 3.8647 3.9080 3.9070 3.8928 4.1807 4.2136 3.7220 3.6375 4.0707 4.0220 3.9150 3.8187 3.9265 3.9787 3.6844 3.8703 3.9946 3.9176 3.8990 3.9010 1.0465 1.0339 1.0055 1.0015 1.0011 1.0179 1.0005 0.9996 1.0170 1.0153 1.0209 1.0051 0.9981 0.9976 1.0089 0.9915 0.9892 0.9902
dispcorr: -0.023513254 hartree
energy: -2149.963123806619
dipole: 0.12249 -1.16742 -1.04493 -30.13965 29.44707 -0.69258 9.70775 -8.32927 1.37848
magnitude: 1.86327 au
magnitude: 4.73605 debye
