program: Orca
programVersion: 5.0.2
elementType: Cl Cl F O O O N C C C C C C C C C C C C C C C C C C C C C C H H H H H H H H H H H H H H H H H H
charge: 0
multiplicity: 1
keywords: wb97x-d3
keywords: def2-TZVPP
keywords: def2/J RIJCOSX
keywords: DEFGRID2
keywords: scfconv7
keywords: smallprint printgap noloewdin
keywords: NOSOSCF
formula: C22H18Cl2FNO3
InChI: InChI=1/C22H18Cl2FNO3/c1-22(2)15(11-19(23)24)20(22)21(27)29-18(12-26)13-8-9-16(25)17(10-13)28-14-6-4-3-5-7-14/h3-11,15,18,20H,1-2H3
47 atoms
Cl -1.384716 1.548708 -3.698829
Cl -4.247292 1.267489 -3.917933
F  2.222552 -3.606292 -1.491619
O  0.450076 2.005236 0.53861
O  -0.605266 0.63774 1.951003
O  2.533499 -3.416452 1.143337
N  3.501288 3.114878 0.055688
C  -2.204148 3.53248 0.370002
C  -1.987199 2.654425 -0.823388
C  -1.904576 2.060398 0.577889
C  -3.602116 3.960603 0.748426
C  -1.173715 4.595881 0.66661
C  -3.076576 2.221334 -1.706658
C  -0.650198 1.494784 1.105191
C  -2.916118 1.748139 -2.936317
C  1.697475 1.422661 0.897894
C  1.881214 0.075187 0.24503
C  2.702286 2.377174 0.424256
C  2.136414 -1.037395 1.030994
C  1.752755 -0.051111 -1.133469
C  2.251263 -2.288431 0.443409
C  1.876843 -1.295317 -1.726757
C  2.11455 -2.398707 -0.93301
C  1.850156 -3.702905 2.295694
C  2.529344 -4.459465 3.240669
C  0.535078 -3.310557 2.510785
C  1.885462 -4.822524 4.413932
C  -0.09115 -3.674017 3.695209
C  0.575997 -4.42707 4.650926
H  -1.029134 2.789518 -1.311158
H  -2.758792 1.472766 0.894417
H  -4.338765 3.163796 0.65106
H  -3.622544 4.290831 1.788393
H  -3.927557 4.798196 0.128653
H  -0.191631 4.381255 0.252021
H  -1.502731 5.544346 0.238055
H  -1.065053 4.743129 1.742728
H  -4.093001 2.277846 -1.335892
H  1.802419 1.341112 1.984262
H  2.237768 -0.933906 2.104694
H  1.555999 0.813514 -1.754608
H  1.778115 -1.413262 -2.797924
H  3.551984 -4.763297 3.055459
H  -0.006391 -2.728622 1.77559
H  2.417426 -5.412457 5.149014
H  -1.114261 -3.364503 3.864702
H  0.079365 -4.705272 5.571004
elementType: Cl F O N C H
totalener: -2149.93617098 hartree
nucrepener: 2966.42028935 hartree
electener: -5116.35646033 hartree
oneelecener: -8845.80785104 hartree
twoeener: 3729.45139071 hartree
cpcmener: -0.03256640 hartree
kineticenergy: 2143.47339150 hartree
xcener: -159.162372907666 hartree
chargesum: 0.0000000
charge: -0.057659 -0.058425 -0.206002 -0.272338 -0.438874 -0.325900 -0.084305 0.093485 0.012243 -0.066720 -0.286100 -0.258557 -0.196568 0.399037 0.045736 0.378578 -0.004175 -0.229107 -0.165940 -0.183200 0.197617 -0.178142 0.218623 0.290979 -0.252938 -0.184712 -0.116957 -0.147227 -0.189472 0.088839 0.099935 0.093375 0.099639 0.105207 0.092835 0.096723 0.101728 0.127590 0.139425 0.151961 0.147355 0.149899 0.146116 0.151309 0.157717 0.159496 0.157868
qa: -0.0577 -0.0584 -0.2060 -0.2723 -0.4389 -0.3259 -0.0843 0.0935 0.0122 -0.0667 -0.2861 -0.2586 -0.1966 0.3990 0.0457 0.3786 -0.0042 -0.2291 -0.1659 -0.1832 0.1976 -0.1781 0.2186 0.2910 -0.2529 -0.1847 -0.1170 -0.1472 -0.1895 0.0888 0.0999 0.0934 0.0996 0.1052 0.0928 0.0967 0.1017 0.1276 0.1394 0.1520 0.1474 0.1499 0.1461 0.1513 0.1577 0.1595 0.1579
va: 1.2716 1.2468 1.0880 2.1278 2.0718 2.0868 3.1062 3.7722 3.8520 3.8220 3.9214 3.9043 3.8812 4.1857 4.2176 3.7756 3.6278 4.0671 3.9269 3.9210 3.7099 3.9082 4.0753 3.6960 4.0021 3.8879 3.8866 3.8998 3.9117 1.0346 1.0265 1.0049 1.0009 0.9990 1.0101 1.0002 1.0002 1.0226 1.0170 1.0045 1.0091 0.9992 1.0080 1.0046 0.9890 0.9907 0.9905
dispcorr: -0.025300748 hartree
energy: -2149.961471726324
dipole: -3.84368 2.09730 -1.74638 10.76365 -9.94085 0.82281 32.31220 -31.14732 1.16488
magnitude: 2.25473 au
magnitude: 5.73107 debye
