program: Orca
programVersion: 5.0.2
elementType: Cl Cl F O O O N C C C C C C C C C C C C C C C C C C C C C C H H H H H H H H H H H H H H H H H H
charge: 0
multiplicity: 1
keywords: wb97x-d3
keywords: def2-TZVPP
keywords: def2/J RIJCOSX
keywords: DEFGRID2
keywords: scfconv7
keywords: smallprint printgap noloewdin
keywords: NOSOSCF
formula: C22H18Cl2FNO3
InChI: InChI=1/C22H18Cl2FNO3/c1-22(2)15(11-19(23)24)20(22)21(27)29-18(12-26)13-8-9-16(25)17(10-13)28-14-6-4-3-5-7-14/h3-11,15,18,20H,1-2H3
47 atoms
Cl -3.145468 5.734178 0.440405
Cl -4.868276 5.312723 -1.833276
F  3.877674 -3.462652 1.843811
O  0.575191 0.897164 -1.27876
O  0.519452 2.034641 0.64431
O  2.458532 -3.957907 -0.447635
N  2.844913 0.61648 -3.660158
C  -2.531871 1.335083 0.562077
C  -2.328305 2.720913 0.025184
C  -1.513876 1.56634 -0.536838
C  -3.75995 0.55253 0.162103
C  -2.09296 1.058718 1.979202
C  -3.309302 3.371437 -0.851896
C  -0.06249 1.544879 -0.288668
C  -3.708425 4.633462 -0.756502
C  1.99513 0.838357 -1.199241
C  2.476038 -0.31972 -0.361938
C  2.454142 0.705022 -2.583899
C  2.188618 -1.625642 -0.750064
C  3.200868 -0.080388 0.794771
C  2.657694 -2.689083 -0.002789
C  3.669507 -1.142633 1.555877
C  3.405808 -2.428472 1.143064
C  1.890808 -4.893421 0.379476
C  0.996103 -4.562296 1.386911
C  2.2298 -6.216968 0.134385
C  0.456386 -5.575636 2.168151
C  1.675878 -7.217179 0.91818
C  0.792946 -6.902447 1.943101
H  -1.777098 3.381141 0.685313
H  -1.807329 1.205739 -1.516037
H  -3.604541 -0.511591 0.347446
H  -4.622125 0.869152 0.752006
H  -4.017101 0.663426 -0.890672
H  -1.311239 1.728807 2.328831
H  -2.946223 1.178069 2.64953
H  -1.733968 0.033066 2.083694
H  -3.745564 2.781598 -1.649287
H  2.405995 1.775253 -0.810846
H  1.619946 -1.831585 -1.649868
H  3.416947 0.933383 1.105309
H  4.247533 -0.971179 2.454548
H  0.711111 -3.533342 1.569811
H  2.925962 -6.457431 -0.659539
H  -0.236438 -5.317725 2.958727
H  1.946349 -8.248272 0.730174
H  0.370663 -7.684748 2.559756
elementType: Cl F O N C H
totalener: -2149.93904303 hartree
nucrepener: 2853.02784158 hartree
electener: -5002.96688461 hartree
oneelecener: -8619.05809874 hartree
twoeener: 3616.09121413 hartree
cpcmener: -0.03191967 hartree
kineticenergy: 2143.46537917 hartree
xcener: -159.158518127398 hartree
chargesum: -0.0000000
charge: -0.054425 -0.058652 -0.205979 -0.284258 -0.446498 -0.320677 -0.087377 0.088775 0.032833 -0.086368 -0.261999 -0.270363 -0.202736 0.401037 0.040194 0.424484 -0.031925 -0.229927 -0.186041 -0.135785 0.132965 -0.169762 0.267055 0.273052 -0.175269 -0.245686 -0.154836 -0.120442 -0.184853 0.082871 0.096584 0.098661 0.101918 0.090442 0.095824 0.097938 0.101671 0.131306 0.135966 0.141158 0.148589 0.152904 0.158521 0.145605 0.158579 0.156894 0.158032
qa: -0.0544 -0.0587 -0.2060 -0.2843 -0.4465 -0.3207 -0.0874 0.0888 0.0328 -0.0864 -0.2620 -0.2704 -0.2027 0.4010 0.0402 0.4245 -0.0319 -0.2299 -0.1860 -0.1358 0.1330 -0.1698 0.2671 0.2731 -0.1753 -0.2457 -0.1548 -0.1204 -0.1849 0.0829 0.0966 0.0987 0.1019 0.0904 0.0958 0.0979 0.1017 0.1313 0.1360 0.1412 0.1486 0.1529 0.1585 0.1456 0.1586 0.1569 0.1580
va: 1.2711 1.2463 1.0847 2.1337 2.0674 2.0771 3.1118 3.7215 3.8653 3.8690 3.9103 3.9053 3.8944 4.1739 4.2138 3.7163 3.6505 4.0697 4.0282 3.9148 3.8202 3.9292 3.9642 3.6836 3.8777 4.0028 3.9095 3.8945 3.9032 1.0459 1.0337 1.0016 1.0007 1.0056 1.0182 1.0002 0.9992 1.0174 1.0171 1.0207 1.0050 0.9982 0.9987 1.0085 0.9909 0.9892 0.9902
dispcorr: -0.023188481 hartree
energy: -2149.962231508971
dipole: -0.65264 -0.43573 -1.08837 -30.20713 29.42806 -0.77907 12.36312 -10.81967 1.54345
magnitude: 2.04297 au
magnitude: 5.19283 debye
