program: Orca
programVersion: 5.0.2
elementType: Cl Cl F O O O N C C C C C C C C C C C C C C C C C C C C C C H H H H H H H H H H H H H H H H H H
charge: 0
multiplicity: 1
keywords: wb97x-d3
keywords: def2-TZVPP
keywords: def2/J RIJCOSX
keywords: DEFGRID2
keywords: scfconv7
keywords: smallprint printgap noloewdin
keywords: NOSOSCF
formula: C22H18Cl2FNO3
InChI: InChI=1/C22H18Cl2FNO3/c1-22(2)15(11-19(23)24)20(22)21(27)29-18(12-26)13-8-9-16(25)17(10-13)28-14-6-4-3-5-7-14/h3-11,15,18,20H,1-2H3
47 atoms
Cl -1.358548 1.244246 -3.572371
Cl -4.222687 0.951332 -3.748306
F  2.200998 -3.501626 -1.550026
O  0.552583 2.094184 0.557226
O  -0.458268 0.720375 1.996603
O  2.446506 -3.356423 1.095085
N  3.597743 3.223636 0.053521
C  -2.143646 3.540995 0.341118
C  -1.936124 2.603835 -0.807674
C  -1.806009 2.090158 0.622479
C  -3.541578 3.953784 0.735993
C  -1.133525 4.643808 0.547769
C  -3.035279 2.097272 -1.638671
C  -0.531146 1.566501 1.141571
C  -2.88461 1.512969 -2.820798
C  1.809923 1.514487 0.891723
C  1.979717 0.172295 0.223439
C  2.805026 2.477196 0.417829
C  2.16566 -0.959877 1.000929
C  1.884632 0.067785 -1.15962
C  2.238526 -2.207855 0.40065
C  1.971034 -1.173349 -1.766329
C  2.134799 -2.295923 -0.980401
C  1.699843 -3.626781 2.213099
C  2.296733 -4.437539 3.169018
C  0.40103 -3.16425 2.384693
C  1.587548 -4.783009 4.309454
C  -0.29065 -3.510428 3.537477
C  0.294328 -4.316598 4.503657
H  -0.992541 2.73044 -1.325376
H  -2.640324 1.503601 0.98957
H  -3.904585 4.753506 0.088086
H  -4.259549 3.135419 0.695162
H  -3.542602 4.330383 1.760072
H  -0.158305 4.428109 0.118539
H  -1.498778 5.556879 0.074772
H  -0.999443 4.856285 1.609961
H  -4.048447 2.191596 -1.266467
H  1.93045 1.422428 1.975601
H  2.241371 -0.875058 2.078307
H  1.742392 0.94808 -1.773894
H  1.897451 -1.273387 -2.841411
H  3.307252 -4.795923 3.016752
H  -0.078298 -2.541925 1.639596
H  2.055755 -5.415624 5.052485
H  -1.300459 -3.14527 3.673363
H  -0.253283 -4.581062 5.398559
elementType: Cl F O N C H
totalener: -2149.93595729 hartree
nucrepener: 2985.55526208 hartree
electener: -5135.49121937 hartree
oneelecener: -8884.10388451 hartree
twoeener: 3748.61266514 hartree
cpcmener: -0.03242578 hartree
kineticenergy: 2143.46763650 hartree
xcener: -159.161192196570 hartree
chargesum: -0.0000000
charge: -0.058091 -0.057967 -0.205919 -0.273037 -0.440080 -0.326559 -0.084326 0.097463 0.000659 -0.063609 -0.287258 -0.257646 -0.191651 0.400372 0.044332 0.380257 0.001028 -0.230525 -0.167299 -0.194939 0.201233 -0.173280 0.217070 0.292698 -0.253867 -0.184136 -0.116934 -0.147810 -0.189488 0.091541 0.099794 0.105283 0.093156 0.100346 0.092480 0.096656 0.101532 0.128374 0.138782 0.151220 0.148686 0.150389 0.146066 0.150239 0.158042 0.159240 0.157479
qa: -0.0581 -0.0580 -0.2059 -0.2730 -0.4401 -0.3266 -0.0843 0.0975 0.0007 -0.0636 -0.2873 -0.2576 -0.1917 0.4004 0.0443 0.3803 0.0010 -0.2305 -0.1673 -0.1949 0.2012 -0.1733 0.2171 0.2927 -0.2539 -0.1841 -0.1169 -0.1478 -0.1895 0.0915 0.0998 0.1053 0.0932 0.1003 0.0925 0.0967 0.1015 0.1284 0.1388 0.1512 0.1487 0.1504 0.1461 0.1502 0.1580 0.1592 0.1575
va: 1.2717 1.2477 1.0883 2.1304 2.0690 2.0866 3.1068 3.7765 3.8586 3.8176 3.9222 3.9014 3.8773 4.1833 4.2175 3.7795 3.6160 4.0652 3.9277 3.9224 3.7044 3.9014 4.0801 3.6956 4.0015 3.8832 3.8864 3.9000 3.9116 1.0329 1.0266 0.9991 1.0046 1.0008 1.0106 1.0002 1.0005 1.0221 1.0165 1.0061 1.0087 0.9991 1.0079 1.0064 0.9888 0.9910 0.9905
dispcorr: -0.025629145 hartree
energy: -2149.961586437929
dipole: -4.22256 2.46310 -1.75946 12.40260 -11.52582 0.87678 31.02467 -29.95152 1.07316
magnitude: 2.23967 au
magnitude: 5.69279 debye
