program: Orca
programVersion: 5.0.2
elementType: Cl Cl F O O O N C C C C C C C C C C C C C C C C C C C C C C H H H H H H H H H H H H H H H H H H
charge: 0
multiplicity: 1
keywords: wb97x-d3
keywords: def2-TZVPP
keywords: def2/J RIJCOSX
keywords: DEFGRID2
keywords: scfconv7
keywords: smallprint printgap noloewdin
keywords: NOSOSCF
formula: C22H18Cl2FNO3
InChI: InChI=1/C22H18Cl2FNO3/c1-22(2)15(11-19(23)24)20(22)21(27)29-18(12-26)13-8-9-16(25)17(10-13)28-14-6-4-3-5-7-14/h3-11,15,18,20H,1-2H3
47 atoms
Cl -4.151003 4.281623 1.144549
Cl -4.718804 5.371859 -1.465659
F  3.966272 -3.987849 -0.545413
O  1.065463 1.522282 -0.76939
O  -0.152724 1.076627 1.054661
O  2.912161 -3.143118 1.824349
N  3.993302 3.04096 -0.973873
C  -2.462782 0.691482 -1.018929
C  -2.549985 2.073846 -0.445274
C  -1.23312 1.579531 -1.024277
C  -3.061844 0.397693 -2.372993
C  -2.576473 -0.472458 -0.064928
C  -3.243307 3.164645 -1.139447
C  -0.096987 1.358281 -0.114447
C  -3.937421 4.133967 -0.556945
C  2.269196 1.319492 -0.031836
C  2.754988 -0.09964 -0.173897
C  3.229944 2.281583 -0.574802
C  2.594256 -0.982369 0.887165
C  3.307722 -0.542746 -1.369604
C  3.004439 -2.298113 0.761434
C  3.719908 -1.858324 -1.503233
C  3.567841 -2.718586 -0.436805
C  2.054325 -4.209713 1.769479
C  2.222843 -5.175947 2.753937
C  1.049188 -4.33319 0.820175
C  1.38095 -6.275715 2.780099
C  0.218498 -5.446019 0.857484
C  0.377515 -6.421104 1.830133
H  -2.578844 2.111483 0.637682
H  -0.961644 1.97695 -1.995336
H  -2.884632 1.185441 -3.103924
H  -2.63495 -0.520838 -2.778699
H  -4.140322 0.252946 -2.290259
H  -2.274134 -0.232418 0.951105
H  -3.615834 -0.803209 -0.024684
H  -1.976586 -1.317772 -0.407649
H  -3.182963 3.195152 -2.220654
H  2.130767 1.567779 1.024387
H  2.160887 -0.652598 1.823513
H  3.435706 0.133433 -2.205781
H  4.165318 -2.212417 -2.423705
H  3.008197 -5.064482 3.491139
H  0.893579 -3.578384 0.059677
H  1.516559 -7.026668 3.547698
H  -0.562064 -5.542303 0.113848
H  -0.273348 -7.284765 1.850293
elementType: Cl F O N C H
totalener: -2149.93956545 hartree
nucrepener: 2871.19832141 hartree
electener: -5021.13788686 hartree
oneelecener: -8655.23478330 hartree
twoeener: 3634.09689644 hartree
cpcmener: -0.03143666 hartree
kineticenergy: 2143.46588392 hartree
xcener: -159.159031262862 hartree
chargesum: 0.0000000
charge: -0.054227 -0.059319 -0.204830 -0.278297 -0.448955 -0.321497 -0.088134 0.090525 0.031622 -0.090521 -0.267117 -0.270350 -0.200199 0.413366 0.041342 0.400434 -0.037322 -0.219928 -0.135960 -0.157364 0.134633 -0.178380 0.270045 0.296710 -0.249628 -0.181094 -0.118274 -0.163186 -0.187514 0.081997 0.097065 0.091757 0.097883 0.102180 0.096072 0.098580 0.100290 0.128501 0.133937 0.138825 0.147614 0.153299 0.144791 0.148875 0.156477 0.157980 0.157295
qa: -0.0542 -0.0593 -0.2048 -0.2783 -0.4490 -0.3215 -0.0881 0.0905 0.0316 -0.0905 -0.2671 -0.2704 -0.2002 0.4134 0.0413 0.4004 -0.0373 -0.2199 -0.1360 -0.1574 0.1346 -0.1784 0.2700 0.2967 -0.2496 -0.1811 -0.1183 -0.1632 -0.1875 0.0820 0.0971 0.0918 0.0979 0.1022 0.0961 0.0986 0.1003 0.1285 0.1339 0.1388 0.1476 0.1533 0.1448 0.1489 0.1565 0.1580 0.1573
va: 1.2714 1.2453 1.0892 2.1324 2.0621 2.0806 3.1099 3.7289 3.8707 3.8543 3.9105 3.9062 3.8988 4.1724 4.2146 3.7297 3.6854 4.0714 3.9816 3.9542 3.7895 3.9316 4.0040 3.6787 3.9905 3.8715 3.8967 3.9209 3.9079 1.0460 1.0331 1.0060 1.0012 1.0007 1.0187 1.0003 0.9993 1.0199 1.0216 1.0218 1.0051 0.9986 1.0092 1.0054 0.9893 0.9911 0.9904
dispcorr: -0.023380094 hartree
energy: -2149.962945541892
dipole: 0.35856 -1.54280 -1.18424 -31.29028 29.66044 -1.62984 -3.17415 2.09569 -1.07846
magnitude: 2.28515 au
magnitude: 5.80838 debye
