program: Orca
programVersion: 5.0.2
elementType: Cl Cl F O O O N C C C C C C C C C C C C C C C C C C C C C C H H H H H H H H H H H H H H H H H H
charge: 0
multiplicity: 1
keywords: wb97x-d3
keywords: def2-TZVPP
keywords: def2/J RIJCOSX
keywords: DEFGRID2
keywords: scfconv7
keywords: smallprint printgap noloewdin
keywords: NOSOSCF
formula: C22H18Cl2FNO3
InChI: InChI=1/C22H18Cl2FNO3/c1-22(2)15(11-19(23)24)20(22)21(27)29-18(12-26)13-8-9-16(25)17(10-13)28-14-6-4-3-5-7-14/h3-11,15,18,20H,1-2H3
47 atoms
Cl -4.356917 4.235628 -2.205096
Cl -6.361045 2.709014 -0.801563
F  4.977656 -2.750594 2.457535
O  0.575708 0.838353 -0.028327
O  0.229714 2.619496 -1.330831
O  2.559437 -3.617535 1.760051
N  1.245147 -0.597107 -3.002702
C  -1.586121 3.294344 1.228951
C  -2.375728 3.100544 -0.034464
C  -1.356329 2.059985 0.377756
C  -2.235238 3.061768 2.571346
C  -0.564768 4.403952 1.250236
C  -3.800244 2.748369 -0.021551
C  -0.133089 1.907797 -0.431362
C  -4.705673 3.179625 -0.890909
C  1.78748 0.565272 -0.721447
C  2.639616 -0.334238 0.133197
C  1.471798 -0.076223 -2.004307
C  2.17267 -1.58548 0.520508
C  3.890913 0.102451 0.542228
C  2.965559 -2.403965 1.306138
C  4.687302 -0.709918 1.335181
C  4.22012 -1.952272 1.701859
C  2.011344 -4.524013 0.88835
C  2.418897 -4.628709 -0.435171
C  1.05149 -5.381368 1.407224
C  1.845216 -5.602042 -1.241448
C  0.495812 -6.355302 0.59096
C  0.884116 -6.467028 -0.737195
H  -2.06047 3.732945 -0.856418
H  -1.733091 1.135912 0.80223
H  -2.824058 3.931967 2.867475
H  -2.89111 2.192072 2.586945
H  -1.471678 2.904005 3.334895
H  0.268668 4.150509 1.908253
H  -0.159956 4.637245 0.267153
H  -1.023095 5.315965 1.636629
H  -4.152504 2.077563 0.752844
H  2.333848 1.486973 -0.939566
H  1.193415 -1.931644 0.209161
H  4.252791 1.077938 0.244816
H  5.666835 -0.383215 1.658651
H  3.176248 -3.970662 -0.842421
H  0.746671 -5.288308 2.442061
H  2.161252 -5.684058 -2.273369
H  -0.251406 -7.024463 0.997715
H  0.443664 -7.223532 -1.373116
elementType: Cl F O N C H
totalener: -2149.93989915 hartree
nucrepener: 2834.72835907 hartree
electener: -4984.66825822 hartree
oneelecener: -8582.68372585 hartree
twoeener: 3598.01546763 hartree
cpcmener: -0.03418952 hartree
kineticenergy: 2143.46078924 hartree
xcener: -159.157886754465 hartree
chargesum: 0.0000000
charge: -0.054794 -0.060345 -0.205446 -0.280574 -0.436728 -0.327005 -0.084934 0.081660 0.026276 -0.067445 -0.267530 -0.259457 -0.203190 0.387158 0.044493 0.433886 -0.013554 -0.235369 -0.169602 -0.145089 0.149857 -0.170587 0.212488 0.274343 -0.175795 -0.244314 -0.150694 -0.120746 -0.185122 0.076868 0.102144 0.102801 0.091988 0.098405 0.100276 0.093296 0.099830 0.128350 0.121139 0.153501 0.149368 0.151736 0.155325 0.146792 0.159767 0.158015 0.158559
qa: -0.0548 -0.0603 -0.2054 -0.2806 -0.4367 -0.3270 -0.0849 0.0817 0.0263 -0.0674 -0.2675 -0.2595 -0.2032 0.3872 0.0445 0.4339 -0.0136 -0.2354 -0.1696 -0.1451 0.1499 -0.1706 0.2125 0.2743 -0.1758 -0.2443 -0.1507 -0.1207 -0.1851 0.0769 0.1021 0.1028 0.0920 0.0984 0.1003 0.0933 0.0998 0.1283 0.1211 0.1535 0.1494 0.1517 0.1553 0.1468 0.1598 0.1580 0.1586
va: 1.2707 1.2440 1.0890 2.1642 2.0753 2.0811 3.1095 3.7662 3.8657 3.8281 3.9061 3.9063 3.9035 4.2095 4.2127 3.7133 3.7415 4.0326 3.9637 3.8829 3.7636 3.8940 4.0699 3.7021 3.8854 3.9985 3.9013 3.8914 3.9069 1.0523 1.0271 1.0005 1.0055 1.0017 1.0001 1.0162 1.0003 1.0196 1.0301 1.0105 0.9987 0.9981 0.9984 1.0073 0.9904 0.9890 0.9902
dispcorr: -0.022713183 hartree
energy: -2149.962612330747
dipole: 13.91868 -13.31015 0.60852 -5.61477 6.10369 0.48892 14.15502 -11.84338 2.31164
magnitude: 2.43988 au
magnitude: 6.20169 debye
