program: Orca
programVersion: 5.0.2
elementType: Cl Cl F O O O N C C C C C C C C C C C C C C C C C C C C C C H H H H H H H H H H H H H H H H H H
charge: 0
multiplicity: 1
keywords: wb97x-d3
keywords: def2-TZVPP
keywords: def2/J RIJCOSX
keywords: DEFGRID2
keywords: scfconv7
keywords: smallprint printgap noloewdin
keywords: NOSOSCF
formula: C22H18Cl2FNO3
InChI: InChI=1/C22H18Cl2FNO3/c1-22(2)15(11-19(23)24)20(22)21(27)29-18(12-26)13-8-9-16(25)17(10-13)28-14-6-4-3-5-7-14/h3-11,15,18,20H,1-2H3
47 atoms
Cl -2.305592 3.867206 -1.924802
Cl -5.173739 3.977241 -1.605617
F  4.46583 -2.433074 2.347101
O  0.506191 0.799853 -1.243217
O  0.689477 2.135475 0.537659
O  2.555509 -3.490589 0.828784
N  2.382032 0.013657 -3.839353
C  -2.122283 0.845313 1.207785
C  -2.291617 2.233028 0.692915
C  -1.450427 1.260084 -0.096905
C  -3.253976 -0.139991 1.04818
C  -1.313329 0.632521 2.461781
C  -3.575612 2.706461 0.130977
C  0.000868 1.471833 -0.193807
C  -3.671166 3.418801 -0.982014
C  1.917978 0.842584 -1.404838
C  2.627903 -0.04069 -0.407706
C  2.15799 0.375322 -2.772831
C  2.229585 -1.364782 -0.264881
C  3.659898 0.469209 0.365352
C  2.856076 -2.175817 0.665912
C  4.300453 -0.342435 1.289697
C  3.881547 -1.646221 1.440263
C  1.244304 -3.876083 0.942511
C  0.897466 -5.093039 0.374864
C  0.308871 -3.119892 1.636073
C  -0.402945 -5.558496 0.506565
C  -0.989485 -3.595795 1.75307
C  -1.352423 -4.812238 1.190724
H  -1.726381 2.995517 1.224074
H  -1.90268 0.839347 -0.987692
H  -3.958945 -0.057665 1.878156
H  -3.810898 0.005423 0.121674
H  -2.870025 -1.161907 1.042141
H  -0.817689 -0.340207 2.448213
H  -0.553607 1.395065 2.621222
H  -1.977358 0.649556 3.328503
H  -4.489547 2.483422 0.670102
H  2.295108 1.868191 -1.336433
H  1.432416 -1.772009 -0.877163
H  3.969141 1.500208 0.253594
H  5.104541 0.040819 1.904305
H  1.639563 -5.670591 -0.161745
H  0.583249 -2.17581 2.090124
H  -0.673563 -6.508317 0.063784
H  -1.718963 -3.011114 2.298772
H  -2.366585 -5.176469 1.287734
elementType: Cl F O N C H
totalener: -2149.93620479 hartree
nucrepener: 3005.34032508 hartree
electener: -5155.27652987 hartree
oneelecener: -8923.55197824 hartree
twoeener: 3768.27544837 hartree
cpcmener: -0.03245764 hartree
kineticenergy: 2143.48257165 hartree
xcener: -159.162373245865 hartree
chargesum: -0.0000000
charge: -0.049067 -0.054671 -0.206738 -0.279546 -0.438130 -0.327209 -0.085808 0.141220 -0.026487 -0.139584 -0.284309 -0.263390 -0.224467 0.387300 0.078225 0.422048 -0.006400 -0.231686 -0.158530 -0.165891 0.152775 -0.161977 0.205434 0.267074 -0.240608 -0.175105 -0.118619 -0.163004 -0.187119 0.112373 0.115249 0.103818 0.095880 0.095487 0.080620 0.097669 0.102404 0.139722 0.138796 0.153680 0.148447 0.152422 0.146897 0.170453 0.157988 0.164888 0.157479
qa: -0.0491 -0.0547 -0.2067 -0.2795 -0.4381 -0.3272 -0.0858 0.1412 -0.0265 -0.1396 -0.2843 -0.2634 -0.2245 0.3873 0.0782 0.4220 -0.0064 -0.2317 -0.1585 -0.1659 0.1528 -0.1620 0.2054 0.2671 -0.2406 -0.1751 -0.1186 -0.1630 -0.1871 0.1124 0.1152 0.1038 0.0959 0.0955 0.0806 0.0977 0.1024 0.1397 0.1388 0.1537 0.1484 0.1524 0.1469 0.1705 0.1580 0.1649 0.1575
va: 1.2812 1.2514 1.0867 2.1234 2.0744 2.0821 3.1132 3.6985 3.8760 3.8368 3.9200 3.8891 3.9098 4.1626 4.1853 3.7246 3.6316 4.0830 3.9299 3.9276 3.7578 3.8857 4.0678 3.7327 4.0024 3.8690 3.8935 3.8911 3.9314 1.0224 1.0234 0.9992 1.0008 1.0075 1.0068 1.0192 1.0023 1.0091 1.0172 1.0128 1.0019 0.9973 1.0071 0.9865 0.9884 0.9850 0.9916
dispcorr: -0.027061715 hartree
energy: -2149.963266508479
dipole: -4.19224 2.73352 -1.45872 -21.46684 21.46740 0.00056 19.28642 -17.45848 1.82794
magnitude: 2.33864 au
magnitude: 5.94435 debye
