program: Orca
programVersion: 5.0.2
elementType: Cl Cl F O O O N C C C C C C C C C C C C C C C C C C C C C C H H H H H H H H H H H H H H H H H H
charge: 0
multiplicity: 1
keywords: wb97x-d3
keywords: def2-TZVPP
keywords: def2/J RIJCOSX
keywords: DEFGRID2
keywords: scfconv7
keywords: smallprint printgap noloewdin
keywords: NOSOSCF
formula: C22H18Cl2FNO3
InChI: InChI=1/C22H18Cl2FNO3/c1-22(2)15(11-19(23)24)20(22)21(27)29-18(12-26)13-8-9-16(25)17(10-13)28-14-6-4-3-5-7-14/h3-11,15,18,20H,1-2H3
47 atoms
Cl -4.017225 5.255525 1.25414
Cl -3.587856 6.920764 -1.061872
F  0.988647 -4.939652 -0.83006
O  0.607389 1.330097 -0.49847
O  -0.985739 0.985994 1.032656
O  1.575052 -4.130618 1.702531
N  3.896779 1.311228 -0.474325
C  -2.882088 1.769541 -1.345226
C  -2.678836 2.985315 -0.489513
C  -1.474148 2.201548 -0.980808
C  -3.2547 1.918498 -2.800766
C  -3.513565 0.560223 -0.70026
C  -2.868636 4.344017 -1.011987
C  -0.646556 1.450687 -0.023608
C  -3.419817 5.357551 -0.356585
C  1.509766 0.530735 0.247381
C  1.343256 -0.942223 -0.049917
C  2.842468 0.97975 -0.163534
C  1.54058 -1.868262 0.965772
C  1.042798 -1.369903 -1.336779
C  1.429811 -3.221792 0.699738
C  0.918408 -2.723733 -1.606721
C  1.109012 -3.632073 -0.588071
C  2.616898 -5.021163 1.638767
C  3.789208 -4.757651 0.94362
C  2.459851 -6.206536 2.344215
C  4.806578 -5.703239 0.95395
C  3.487241 -7.137095 2.348436
C  4.663234 -6.893961 1.65038
H  -2.919054 2.843138 0.55826
H  -0.915306 2.654386 -1.791828
H  -3.018551 1.000398 -3.341946
H  -4.326631 2.096981 -2.904874
H  -2.729301 2.731602 -3.29991
H  -3.372557 0.520111 0.376945
H  -4.588839 0.575856 -0.886319
H  -3.119839 -0.362595 -1.13021
H  -2.525284 4.54831 -2.019204
H  1.416318 0.714089 1.323277
H  1.778862 -1.5450 1.972312
H  0.899656 -0.660155 -2.140792
H  0.673936 -3.071734 -2.601869
H  3.926314 -3.829098 0.403396
H  1.539397 -6.397306 2.881862
H  5.720758 -5.497653 0.41195
H  3.361659 -8.062199 2.896165
H  5.460951 -7.625148 1.65198
elementType: Cl F O N C H
totalener: -2149.93863613 hartree
nucrepener: 2822.52698555 hartree
electener: -4972.46562168 hartree
oneelecener: -8558.04431070 hartree
twoeener: 3585.57868902 hartree
cpcmener: -0.03313546 hartree
kineticenergy: 2143.46383162 hartree
xcener: -159.158245457516 hartree
chargesum: -0.0000000
charge: -0.054125 -0.059005 -0.206830 -0.285295 -0.437295 -0.325090 -0.085738 0.091425 0.031495 -0.079259 -0.264061 -0.265832 -0.197867 0.378425 0.037036 0.404255 0.013628 -0.229172 -0.191403 -0.168031 0.137943 -0.177658 0.283023 0.256642 -0.157637 -0.229647 -0.167783 -0.127745 -0.178517 0.083401 0.096769 0.098414 0.101722 0.090778 0.096329 0.098889 0.098996 0.129728 0.142259 0.140114 0.149797 0.152763 0.154427 0.146061 0.159057 0.156841 0.157771
qa: -0.0541 -0.0590 -0.2068 -0.2853 -0.4373 -0.3251 -0.0857 0.0914 0.0315 -0.0793 -0.2641 -0.2658 -0.1979 0.3784 0.0370 0.4043 0.0136 -0.2292 -0.1914 -0.1680 0.1379 -0.1777 0.2830 0.2566 -0.1576 -0.2296 -0.1678 -0.1277 -0.1785 0.0834 0.0968 0.0984 0.1017 0.0908 0.0963 0.0989 0.0990 0.1297 0.1423 0.1401 0.1498 0.1528 0.1544 0.1461 0.1591 0.1568 0.1578
va: 1.2716 1.2454 1.0848 2.1146 2.0762 2.0720 3.1128 3.7286 3.8915 3.8400 3.9096 3.9036 3.8927 4.2006 4.2147 3.7090 3.6446 4.0782 4.0383 3.9231 3.7889 3.9291 3.9870 3.6919 3.8606 3.9882 3.9200 3.9052 3.8957 1.0441 1.0346 1.0013 1.0011 1.0057 1.0181 1.0007 0.9997 1.0186 1.0210 1.0133 1.0108 0.9984 1.0009 1.0080 0.9909 0.9893 0.9901
dispcorr: -0.023324080 hartree
energy: -2149.961960208817
dipole: 7.55663 -8.42096 -0.86432 -29.30416 28.57367 -0.73050 -7.13483 5.87066 -1.26417
magnitude: 1.69670 au
magnitude: 4.31268 debye
