program: Orca
programVersion: 5.0.2
elementType: Cl Cl F O O O N C C C C C C C C C C C C C C C C C C C C C C H H H H H H H H H H H H H H H H H H
charge: 0
multiplicity: 1
keywords: wb97x-d3
keywords: def2-TZVPP
keywords: def2/J RIJCOSX
keywords: DEFGRID2
keywords: scfconv7
keywords: smallprint printgap noloewdin
keywords: NOSOSCF
formula: C22H18Cl2FNO3
InChI: InChI=1/C22H18Cl2FNO3/c1-22(2)15(11-19(23)24)20(22)21(27)29-18(12-26)13-8-9-16(25)17(10-13)28-14-6-4-3-5-7-14/h3-11,15,18,20H,1-2H3
47 atoms
Cl -2.23112 4.260061 -1.078786
Cl -5.075841 4.181007 -1.568297
F  4.383868 -3.545965 0.939262
O  0.751271 1.208941 -1.064039
O  0.272416 1.582535 1.089726
O  1.804401 -3.522644 0.155206
N  3.28418 2.053136 -3.008913
C  -2.398164 0.109019 0.204987
C  -2.6331 1.567466 0.390756
C  -1.48322 1.123028 -0.478849
C  -3.293945 -0.66641 -0.728706
C  -1.908887 -0.708025 1.373331
C  -3.789792 2.249144 -0.230763
C  -0.101032 1.339001 -0.027959
C  -3.707934 3.404737 -0.873553
C  2.133735 1.29695 -0.78685
C  2.723537 -0.02217 -0.32379
C  2.760338 1.717705 -2.043446
C  1.965625 -1.181915 -0.309016
C  4.053489 -0.058099 0.082837
C  2.531067 -2.369531 0.129274
C  4.629743 -1.247475 0.494945
C  3.858311 -2.392859 0.52139
C  0.836432 -3.64437 1.119189
C  0.924267 -3.012541 2.353309
C  -0.244478 -4.46176 0.816299
C  -0.086053 -3.207282 3.285982
C  -1.243122 -4.648631 1.760484
C  -1.172273 -4.020748 2.997474
H  -2.345772 1.965152 1.361525
H  -1.62428 1.200608 -1.550829
H  -3.611328 -0.082233 -1.593064
H  -2.776704 -1.552519 -1.100689
H  -4.191242 -1.003532 -0.205945
H  -1.318485 -1.558414 1.028496
H  -1.307937 -0.138338 2.078958
H  -2.765331 -1.104252 1.922138
H  -4.768288 1.791448 -0.136413
H  2.342743 2.07494 -0.043238
H  0.933018 -1.199546 -0.63505
H  4.653288 0.843952 0.076711
H  5.665205 -1.28213 0.808668
H  1.763041 -2.37411 2.600717
H  -0.300467 -4.945622 -0.151033
H  -0.016707 -2.714145 4.247257
H  -2.085816 -5.284271 1.520713
H  -1.956711 -4.164347 3.728911
elementType: Cl F O N C H
totalener: -2149.93569434 hartree
nucrepener: 3021.51914040 hartree
electener: -5171.45483474 hartree
oneelecener: -8955.92546502 hartree
twoeener: 3784.47063028 hartree
cpcmener: -0.03171506 hartree
kineticenergy: 2143.46705820 hartree
xcener: -159.162098477311 hartree
chargesum: -0.0000000
charge: -0.048884 -0.054687 -0.206415 -0.282984 -0.431268 -0.331669 -0.084602 0.173804 -0.017439 -0.165598 -0.286293 -0.258913 -0.226933 0.379002 0.078362 0.398377 0.023040 -0.230243 -0.134022 -0.198365 0.130568 -0.158244 0.228990 0.255826 -0.164788 -0.206448 -0.157591 -0.128019 -0.188266 0.112042 0.117153 0.097217 0.100450 0.103121 0.049089 0.102546 0.106581 0.139448 0.146542 0.150872 0.150943 0.152805 0.149120 0.145039 0.157521 0.156714 0.156495
qa: -0.0489 -0.0547 -0.2064 -0.2830 -0.4313 -0.3317 -0.0846 0.1738 -0.0174 -0.1656 -0.2863 -0.2589 -0.2269 0.3790 0.0784 0.3984 0.0230 -0.2302 -0.1340 -0.1984 0.1306 -0.1582 0.2290 0.2558 -0.1648 -0.2064 -0.1576 -0.1280 -0.1883 0.1120 0.1172 0.0972 0.1005 0.1031 0.0491 0.1025 0.1066 0.1394 0.1465 0.1509 0.1509 0.1528 0.1491 0.1450 0.1575 0.1567 0.1565
va: 1.2809 1.2514 1.0873 2.1019 2.0755 2.0747 3.1157 3.7046 3.8872 3.8625 3.9144 3.8709 3.9114 4.1498 4.1885 3.7054 3.6603 4.0587 3.9643 3.9670 3.7655 3.8756 4.0586 3.6947 3.8234 3.9507 3.8605 3.8838 3.8703 1.0223 1.0245 0.9992 1.0028 0.9995 1.0181 1.0168 1.0030 1.0093 1.0200 1.0080 0.9993 0.9968 1.0045 1.0075 0.9920 0.9893 0.9915
dispcorr: -0.028370794 hartree
energy: -2149.964065137311
dipole: -5.64579 4.19302 -1.45277 -26.45733 25.61222 -0.84511 15.28349 -13.80836 1.47513
magnitude: 2.23624 au
magnitude: 5.68406 debye
