program: Orca
programVersion: 5.0.2
elementType: Cl Cl F O O O N C C C C C C C C C C C C C C C C C C C C C C H H H H H H H H H H H H H H H H H H
charge: 0
multiplicity: 1
keywords: wb97x-d3
keywords: def2-TZVPP
keywords: def2/J RIJCOSX
keywords: DEFGRID2
keywords: scfconv7
keywords: smallprint printgap noloewdin
keywords: NOSOSCF
formula: C22H18Cl2FNO3
InChI: InChI=1/C22H18Cl2FNO3/c1-22(2)15(11-19(23)24)20(22)21(27)29-18(12-26)13-8-9-16(25)17(10-13)28-14-6-4-3-5-7-14/h3-11,15,18,20H,1-2H3
47 atoms
Cl -1.978446 4.671284 -0.183858
Cl -4.843909 4.894561 -0.451433
F  3.999436 -3.447072 1.218572
O  0.811075 1.456369 -1.149578
O  0.39978 1.480746 1.043942
O  2.004845 -3.457712 -0.625055
N  3.429963 1.89208 -3.122738
C  -2.367052 0.335609 -0.067214
C  -2.492579 1.703181 0.514293
C  -1.420811 1.446343 -0.513185
C  -3.366599 -0.108622 -1.106612
C  -1.867244 -0.789346 0.804437
C  -3.630753 2.590847 0.188616
C  -0.013173 1.468404 -0.086188
C  -3.500702 3.875718 -0.108726
C  2.199693 1.430056 -0.864615
C  2.669647 0.10944 -0.297579
C  2.864051 1.69085 -2.143871
C  2.098709 -1.083899 -0.723872
C  3.683486 0.098959 0.647764
C  2.543584 -2.282743 -0.198404
C  4.148706 -1.101999 1.162942
C  3.575499 -2.277634 0.732639
C  1.255299 -4.198559 0.250827
C  0.713614 -3.675897 1.417833
C  1.030569 -5.522579 -0.104213
C  -0.048932 -4.499779 2.236329
C  0.263875 -6.328838 0.721672
C  -0.276198 -5.825208 1.898417
H  -2.125911 1.808443 1.53284
H  -1.595579 1.813317 -1.518453
H  -2.936573 -0.881434 -1.745918
H  -4.252231 -0.531955 -0.628609
H  -3.6940 0.706999 -1.752262
H  -1.332005 -1.53163 0.208995
H  -1.207955 -0.454555 1.60309
H  -2.713306 -1.295198 1.27339
H  -4.633109 2.179049 0.227279
H  2.477222 2.243295 -0.18464
H  1.303699 -1.100552 -1.459941
H  4.119268 1.029092 0.98928
H  4.943672 -1.12378 1.896888
H  0.868267 -2.641812 1.699244
H  1.456184 -5.915413 -1.019173
H  -0.467473 -4.091597 3.147275
H  0.094437 -7.361152 0.443705
H  -0.868905 -6.460079 2.543495
elementType: Cl F O N C H
totalener: -2149.93682010 hartree
nucrepener: 2980.70152524 hartree
electener: -5130.63834534 hartree
oneelecener: -8874.51011028 hartree
twoeener: 3743.87176494 hartree
cpcmener: -0.03225436 hartree
kineticenergy: 2143.47822572 hartree
xcener: -159.161732294418 hartree
chargesum: 0.0000000
charge: -0.049589 -0.055484 -0.206739 -0.282873 -0.430677 -0.325262 -0.086113 0.154250 -0.019996 -0.155167 -0.281907 -0.284971 -0.229934 0.389407 0.079824 0.404231 -0.010058 -0.226082 -0.191003 -0.151996 0.143633 -0.165653 0.272837 0.310160 -0.214548 -0.238152 -0.163026 -0.124746 -0.180648 0.111276 0.117911 0.101235 0.102601 0.094787 0.097469 0.097016 0.102857 0.140416 0.144953 0.142221 0.146605 0.152833 0.152036 0.145295 0.157678 0.156727 0.156363
qa: -0.0496 -0.0555 -0.2067 -0.2829 -0.4307 -0.3253 -0.0861 0.1543 -0.0200 -0.1552 -0.2819 -0.2850 -0.2299 0.3894 0.0798 0.4042 -0.0101 -0.2261 -0.1910 -0.1520 0.1436 -0.1657 0.2728 0.3102 -0.2145 -0.2382 -0.1630 -0.1247 -0.1806 0.1113 0.1179 0.1012 0.1026 0.0948 0.0975 0.0970 0.1029 0.1404 0.1450 0.1422 0.1466 0.1528 0.1520 0.1453 0.1577 0.1567 0.1564
va: 1.2801 1.2504 1.0867 2.1170 2.0770 2.0789 3.1130 3.7193 3.8720 3.8394 3.9118 3.8912 3.9103 4.1617 4.1865 3.7202 3.6344 4.0729 3.9771 3.9523 3.7808 3.9115 3.9892 3.6416 3.8569 3.9903 3.9185 3.8996 3.9022 1.0244 1.0224 1.0034 0.9999 0.9987 0.9975 1.0139 1.0039 1.0089 1.0150 1.0216 1.0001 0.9976 1.0026 1.0085 0.9914 0.9891 0.9904
dispcorr: -0.026714029 hartree
energy: -2149.963534129635
dipole: -5.00063 3.49246 -1.50817 -31.55974 30.75836 -0.80138 6.35331 -5.00117 1.35214
magnitude: 2.17832 au
magnitude: 5.53684 debye
