program: Orca
programVersion: 5.0.2
elementType: Cl Cl F O O O N C C C C C C C C C C C C C C C C C C C C C C H H H H H H H H H H H H H H H H H H
charge: 0
multiplicity: 1
keywords: wb97x-d3
keywords: def2-TZVPP
keywords: def2/J RIJCOSX
keywords: DEFGRID2
keywords: scfconv7
keywords: smallprint printgap noloewdin
keywords: NOSOSCF
formula: C22H18Cl2FNO3
InChI: InChI=1/C22H18Cl2FNO3/c1-22(2)15(11-19(23)24)20(22)21(27)29-18(12-26)13-8-9-16(25)17(10-13)28-14-6-4-3-5-7-14/h3-11,15,18,20H,1-2H3
47 atoms
Cl -2.233888 -0.633786 -1.590246
Cl -4.251545 -1.145243 0.405343
F  3.232422 -3.084498 0.670891
O  1.126662 2.688339 -0.173396
O  1.346458 2.55608 2.042287
O  1.320103 -2.306373 -1.082777
N  3.109147 3.0132 -2.786083
C  -1.784044 3.47227 0.279329
C  -1.675129 1.993129 0.058496
C  -0.834428 2.66607 1.13958
C  -2.983067 4.034812 1.006259
C  -1.284472 4.393177 -0.809208
C  -2.710466 1.041072 0.47449
C  0.63598 2.644329 1.073606
C  -3.010845 -0.089633 -0.153979
C  2.504353 2.371627 -0.327142
C  2.747358 0.900816 -0.091544
C  2.827538 2.741014 -1.706506
C  1.929211 -0.033393 -0.719411
C  3.731604 0.484191 0.789812
C  2.096146 -1.378628 -0.458216
C  3.915066 -0.867514 1.045267
C  3.091499 -1.78057 0.425503
C  0.321374 -2.918301 -0.369684
C  -0.1668 -2.423783 0.832164
C  -0.216731 -4.066136 -0.93626
C  -1.203854 -3.095614 1.466372
C  -1.252827 -4.72247 -0.290801
C  -1.750818 -4.243928 0.914279
H  -1.127725 1.716848 -0.834512
H  -1.175849 2.514484 2.157255
H  -2.760399 5.037201 1.375978
H  -3.836395 4.113139 0.330225
H  -3.288631 3.435691 1.863496
H  -0.840407 5.294617 -0.38302
H  -0.553789 3.933359 -1.469685
H  -2.127164 4.705388 -1.428807
H  -3.274177 1.262485 1.373111
H  3.13388 2.975073 0.334473
H  1.151925 0.270306 -1.41126
H  4.360365 1.21064 1.287961
H  4.680589 -1.20649 1.730813
H  0.233354 -1.521445 1.276902
H  0.173546 -4.439671 -1.874859
H  -1.586154 -2.707777 2.401786
H  -1.669041 -5.618219 -0.733747
H  -2.558059 -4.760826 1.416193
elementType: Cl F O N C H
totalener: -2149.93590696 hartree
nucrepener: 3152.10464471 hartree
electener: -5302.04055167 hartree
oneelecener: -9217.52919188 hartree
twoeener: 3915.48864021 hartree
cpcmener: -0.03387811 hartree
kineticenergy: 2143.47223074 hartree
xcener: -159.163231185256 hartree
chargesum: 0.0000000
charge: -0.059547 -0.062859 -0.205773 -0.277327 -0.431706 -0.319935 -0.083793 0.090493 0.033432 -0.052181 -0.277334 -0.259193 -0.214936 0.367105 0.070640 0.390128 -0.033854 -0.231828 -0.159783 -0.138821 0.127029 -0.169218 0.274538 0.254556 -0.141040 -0.225414 -0.198554 -0.124861 -0.174156 0.086508 0.096233 0.100467 0.102547 0.092252 0.101649 0.093215 0.095817 0.127280 0.140029 0.141050 0.149479 0.152499 0.145294 0.143652 0.154249 0.156041 0.155930
qa: -0.0595 -0.0629 -0.2058 -0.2773 -0.4317 -0.3199 -0.0838 0.0905 0.0334 -0.0522 -0.2773 -0.2592 -0.2149 0.3671 0.0706 0.3901 -0.0339 -0.2318 -0.1598 -0.1388 0.1270 -0.1692 0.2745 0.2546 -0.1410 -0.2254 -0.1986 -0.1249 -0.1742 0.0865 0.0962 0.1005 0.1025 0.0923 0.1016 0.0932 0.0958 0.1273 0.1400 0.1410 0.1495 0.1525 0.1453 0.1437 0.1542 0.1560 0.1559
va: 1.2651 1.2385 1.0891 2.1195 2.0770 2.0746 3.1071 3.7557 3.8461 3.8252 3.9217 3.9036 3.9257 4.2103 4.1809 3.7741 3.6633 4.0689 3.9732 3.9207 3.8087 3.9077 4.0037 3.6506 3.7770 3.9774 3.8922 3.9079 3.8710 1.0276 1.0282 1.0004 0.9998 1.0056 1.0005 1.0112 1.0001 1.0224 1.0142 1.0199 0.9997 0.9975 1.0081 1.0088 0.9951 0.9887 0.9899
dispcorr: -0.030040529 hartree
energy: -2149.965947490603
dipole: -4.09812 3.17232 -0.92580 20.59888 -19.48901 1.10987 8.05688 -6.44931 1.60757
magnitude: 2.16176 au
magnitude: 5.49475 debye
