program: Orca
programVersion: 5.0.2
elementType: Cl Cl F O O O N C C C C C C C C C C C C C C C C C C C C C C H H H H H H H H H H H H H H H H H H
charge: 0
multiplicity: 1
keywords: wb97x-d3
keywords: def2-TZVPP
keywords: def2/J RIJCOSX
keywords: DEFGRID2
keywords: scfconv7
keywords: smallprint printgap noloewdin
keywords: NOSOSCF
formula: C22H18Cl2FNO3
InChI: InChI=1/C22H18Cl2FNO3/c1-22(2)15(11-19(23)24)20(22)21(27)29-18(12-26)13-8-9-16(25)17(10-13)28-14-6-4-3-5-7-14/h3-11,15,18,20H,1-2H3
47 atoms
Cl -2.27925 3.916036 -1.844557
Cl -5.113264 4.155202 -1.341521
F  4.590261 -2.312071 2.348977
O  0.459027 0.721014 -1.218724
O  0.783744 2.153839 0.464008
O  2.595194 -3.446539 1.042769
N  2.152033 -0.288792 -3.863514
C  -2.009243 0.982806 1.371595
C  -2.155218 2.356511 0.81337
C  -1.413436 1.316538 0.008606
C  -3.197352 0.053539 1.333831
C  -1.117434 0.768311 2.56831
C  -3.455354 2.864306 0.322923
C  0.036436 1.466627 -0.183519
C  -3.596799 3.547588 -0.803276
C  1.859165 0.722788 -1.471883
C  2.618436 -0.094276 -0.455361
C  2.003654 0.149455 -2.812514
C  2.226977 -1.406296 -0.210014
C  3.677637 0.466603 0.238843
C  2.886931 -2.15588 0.748562
C  4.359549 -0.287723 1.183116
C  3.953174 -1.578627 1.432135
C  1.305277 -3.901264 0.916588
C  0.229715 -3.200217 1.446406
C  1.120968 -5.121259 0.285664
C  -1.04582 -3.730827 1.325474
C  -0.160067 -5.646367 0.184271
C  -1.247423 -4.951523 0.694359
H  -1.521814 3.11418 1.268872
H  -1.9400 0.882958 -0.834009
H  -2.869119 -0.987479 1.347483
H  -3.832991 0.210523 2.207759
H  -3.812526 0.192092 0.444089
H  -0.648112 -0.216984 2.534893
H  -0.329242 1.51245 2.659327
H  -1.714202 0.814065 3.480976
H  -4.339131 2.695357 0.927838
H  2.254207 1.743338 -1.508809
H  1.40573 -1.845154 -0.764683
H  3.976299 1.489596 0.052209
H  5.189379 0.131188 1.737204
H  0.378105 -2.252411 1.949339
H  1.971413 -5.656622 -0.11761
H  -1.886668 -3.185082 1.734383
H  -0.305524 -6.600358 -0.305853
H  -2.245417 -5.359919 0.605056
elementType: Cl F O N C H
totalener: -2149.93637251 hartree
nucrepener: 3001.91952565 hartree
electener: -5151.85589816 hartree
oneelecener: -8916.75586296 hartree
twoeener: 3764.89996480 hartree
cpcmener: -0.03272441 hartree
kineticenergy: 2143.48450172 hartree
xcener: -159.163408938737 hartree
chargesum: 0.0000000
charge: -0.049461 -0.054771 -0.207787 -0.278523 -0.438187 -0.322597 -0.086204 0.130696 -0.028525 -0.132996 -0.280771 -0.262791 -0.223310 0.384959 0.077365 0.422236 -0.003762 -0.232078 -0.189808 -0.178978 0.191462 -0.152252 0.191198 0.272349 -0.213102 -0.228832 -0.153143 -0.122801 -0.181579 0.112485 0.115115 0.092516 0.103022 0.096426 0.087902 0.097329 0.100840 0.139540 0.139691 0.150574 0.147599 0.151870 0.185586 0.146975 0.168357 0.158376 0.157789
qa: -0.0495 -0.0548 -0.2078 -0.2785 -0.4382 -0.3226 -0.0862 0.1307 -0.0285 -0.1330 -0.2808 -0.2628 -0.2233 0.3850 0.0774 0.4222 -0.0038 -0.2321 -0.1898 -0.1790 0.1915 -0.1523 0.1912 0.2723 -0.2131 -0.2288 -0.1531 -0.1228 -0.1816 0.1125 0.1151 0.0925 0.1030 0.0964 0.0879 0.0973 0.1008 0.1395 0.1397 0.1506 0.1476 0.1519 0.1856 0.1470 0.1684 0.1584 0.1578
va: 1.2807 1.2513 1.0845 2.1265 2.0739 2.0891 3.1135 3.7092 3.8797 3.8344 3.9191 3.8862 3.9084 4.1673 4.1859 3.7264 3.6429 4.0827 3.9255 3.9298 3.7380 3.8826 4.0630 3.7354 3.9168 4.0012 3.8970 3.8866 3.9284 1.0230 1.0229 1.0106 1.0002 0.9996 1.0040 1.0175 1.0025 1.0092 1.0162 1.0135 1.0032 0.9975 0.9698 1.0066 0.9849 0.9888 0.9914
dispcorr: -0.026799728 hartree
energy: -2149.963172235013
dipole: -3.55769 2.12286 -1.43484 -21.40670 21.40375 -0.00295 18.20767 -16.47776 1.72990
magnitude: 2.24752 au
magnitude: 5.71273 debye
