program: Orca
programVersion: 5.0.2
elementType: Cl Cl F O O O N C C C C C C C C C C C C C C C C C C C C C C H H H H H H H H H H H H H H H H H H
charge: 0
multiplicity: 1
keywords: wb97x-d3
keywords: def2-TZVPP
keywords: def2/J RIJCOSX
keywords: DEFGRID2
keywords: scfconv7
keywords: smallprint printgap noloewdin
keywords: NOSOSCF
formula: C22H18Cl2FNO3
InChI: InChI=1/C22H18Cl2FNO3/c1-22(2)15(11-19(23)24)20(22)21(27)29-18(12-26)13-8-9-16(25)17(10-13)28-14-6-4-3-5-7-14/h3-11,15,18,20H,1-2H3
47 atoms
Cl -2.408881 -0.668178 -1.609981
Cl -4.412875 -1.126445 0.412663
F  3.501498 -3.085762 0.660861
O  1.085799 2.588339 -0.169382
O  1.295005 2.445109 2.046516
O  1.501188 -2.416621 -1.0206
N  3.085039 3.012806 -2.75702
C  -1.809265 3.406945 0.267319
C  -1.732836 1.923685 0.055133
C  -0.880812 2.583313 1.134363
C  -2.996933 4.00149 0.987201
C  -1.286475 4.310021 -0.825641
C  -2.793549 1.001973 0.476606
C  0.589489 2.542781 1.075089
C  -3.146148 -0.109023 -0.159586
C  2.474859 2.3267 -0.311803
C  2.785894 0.868494 -0.07742
C  2.797329 2.714542 -1.686143
C  1.997245 -0.105328 -0.680989
C  3.82392 0.502386 0.764734
C  2.243363 -1.44064 -0.427522
C  4.086812 -0.837439 1.009677
C  3.286272 -1.791443 0.420521
C  0.406636 -2.908991 -0.358822
C  -0.102552 -2.34929 0.805044
C  -0.200403 -4.016745 -0.93735
C  -1.231827 -2.912468 1.386088
C  -1.324639 -4.566033 -0.34309
C  -1.848311 -4.01774 0.820855
H  -1.191211 1.629312 -0.835696
H  -1.228766 2.44263 2.151384
H  -2.749179 4.997555 1.358187
H  -3.844114 4.102921 0.306538
H  -3.323038 3.410838 1.842635
H  -2.123012 4.650331 -1.438668
H  -0.808211 5.196502 -0.405101
H  -0.577805 3.825172 -1.492115
H  -3.333349 1.232527 1.387431
H  3.07258 2.9554 0.355993
H  1.182707 0.158541 -1.345703
H  4.433008 1.260625 1.239585
H  4.894025 -1.13595 1.665516
H  0.354642 -1.482241 1.264316
H  0.208714 -4.443207 -1.844873
H  -1.629415 -2.473317 2.29195
H  -1.793019 -5.430761 -0.795545
H  -2.727131 -4.448872 1.281609
elementType: Cl F O N C H
totalener: -2149.93648815 hartree
nucrepener: 3142.18841437 hartree
electener: -5292.12490252 hartree
oneelecener: -9197.58182658 hartree
twoeener: 3905.45692406 hartree
cpcmener: -0.03399044 hartree
kineticenergy: 2143.47240421 hartree
xcener: -159.163362446418 hartree
chargesum: -0.0000000
charge: -0.058214 -0.062701 -0.205673 -0.276207 -0.433220 -0.324889 -0.083306 0.093184 0.036302 -0.058011 -0.275369 -0.260706 -0.221808 0.373457 0.068512 0.387556 -0.029973 -0.232199 -0.151507 -0.140473 0.127911 -0.174735 0.269536 0.298905 -0.174969 -0.240048 -0.177323 -0.113322 -0.192757 0.087562 0.095607 0.100515 0.102028 0.092000 0.095987 0.102222 0.092635 0.127201 0.141155 0.142053 0.149650 0.152858 0.143985 0.142885 0.154283 0.155789 0.153628
qa: -0.0582 -0.0627 -0.2057 -0.2762 -0.4332 -0.3249 -0.0833 0.0932 0.0363 -0.0580 -0.2754 -0.2607 -0.2218 0.3735 0.0685 0.3876 -0.0300 -0.2322 -0.1515 -0.1405 0.1279 -0.1747 0.2695 0.2989 -0.1750 -0.2400 -0.1773 -0.1133 -0.1928 0.0876 0.0956 0.1005 0.1020 0.0920 0.0960 0.1022 0.0926 0.1272 0.1412 0.1421 0.1497 0.1529 0.1440 0.1429 0.1543 0.1558 0.1536
va: 1.2659 1.2401 1.0904 2.1205 2.0748 2.0828 3.1080 3.7478 3.8417 3.8329 3.9212 3.9066 3.9307 4.2029 4.1956 3.7682 3.6500 4.0704 3.9698 3.9210 3.7904 3.8998 4.0267 3.6429 3.8093 3.9861 3.8656 3.8932 3.8867 1.0272 1.0288 1.0003 1.0000 1.0057 1.0002 1.0004 1.0109 1.0223 1.0145 1.0174 0.9993 0.9973 1.0110 1.0097 0.9949 0.9886 0.9928
dispcorr: -0.029899761 hartree
energy: -2149.966387914275
dipole: -3.90441 2.97417 -0.93024 21.00164 -19.79949 1.20216 7.76233 -6.20178 1.56056
magnitude: 2.17850 au
magnitude: 5.53731 debye
