program: Orca
programVersion: 5.0.2
elementType: Cl Cl F O O O N C C C C C C C C C C C C C C C C C C C C C C H H H H H H H H H H H H H H H H H H
charge: 0
multiplicity: 1
keywords: wb97x-d3
keywords: def2-TZVPP
keywords: def2/J RIJCOSX
keywords: DEFGRID2
keywords: scfconv7
keywords: smallprint printgap noloewdin
keywords: NOSOSCF
formula: C22H18Cl2FNO3
InChI: InChI=1/C22H18Cl2FNO3/c1-22(2)15(11-19(23)24)20(22)21(27)29-18(12-26)13-8-9-16(25)17(10-13)28-14-6-4-3-5-7-14/h3-11,15,18,20H,1-2H3
47 atoms
Cl -1.768723 5.087027 -1.157335
Cl -4.626081 5.485104 -0.989402
F  2.895856 -2.910575 2.638167
O  0.530367 1.143388 -1.47183
O  0.714571 2.218788 0.478228
O  0.628736 -3.13279 1.124965
N  2.560295 -0.085766 -3.770284
C  -2.292526 1.087953 0.559211
C  -2.225605 2.578923 0.566372
C  -1.448387 1.824144 -0.477688
C  -3.527747 0.41293 0.017081
C  -1.63901 0.330049 1.687279
C  -3.383268 3.409369 0.166945
C  0.020481 1.784679 -0.403363
C  -3.274824 4.50908 -0.563676
C  1.91324 0.829342 -1.41053
C  2.208268 -0.204538 -0.347288
C  2.252699 0.317283 -2.740015
C  1.324343 -1.259129 -0.149026
C  3.34329 -0.088343 0.438816
C  1.555105 -2.171513 0.863021
C  3.595763 -1.016094 1.439415
C  2.69346 -2.034868 1.650508
C  0.972215 -4.455875 1.017951
C  0.209409 -5.34981 1.757461
C  1.991666 -4.905074 0.190402
C  0.476749 -6.707021 1.670048
C  2.250419 -6.268082 0.119299
C  1.500512 -7.173438 0.855358
H  -1.620057 3.011142 1.359649
H  -1.851251 1.80363 -1.48447
H  -3.97302 0.957381 -0.816396
H  -3.28959 -0.591555 -0.336791
H  -4.286519 0.316411 0.796376
H  -0.758712 0.82837 2.089513
H  -2.348912 0.216288 2.508871
H  -1.344903 -0.672208 1.369505
H  -4.370681 3.126154 0.513724
H  2.520174 1.725086 -1.24146
H  0.435653 -1.374186 -0.757911
H  4.030556 0.733989 0.28796
H  4.471331 -0.930866 2.069655
H  -0.58503 -4.9827 2.395266
H  2.579387 -4.215482 -0.402986
H  -0.116988 -7.402241 2.24963
H  3.046468 -6.61933 -0.524517
H  1.709812 -8.233161 0.793603
elementType: Cl F O N C H
totalener: -2149.93606544 hartree
nucrepener: 2949.43157630 hartree
electener: -5099.36764174 hartree
oneelecener: -8812.23074935 hartree
twoeener: 3712.86310761 hartree
cpcmener: -0.03196562 hartree
kineticenergy: 2143.47936599 hartree
xcener: -159.160970174035 hartree
chargesum: 0.0000000
charge: -0.049582 -0.055492 -0.207284 -0.281030 -0.423042 -0.327987 -0.086116 0.148777 -0.031000 -0.142608 -0.282751 -0.274073 -0.217284 0.370158 0.070516 0.416001 0.012762 -0.230174 -0.219350 -0.158884 0.147909 -0.160790 0.267107 0.262663 -0.242528 -0.160159 -0.127262 -0.164330 -0.177732 0.113084 0.115294 0.094422 0.100629 0.102628 0.096508 0.107065 0.090336 0.140162 0.144298 0.146377 0.148450 0.153382 0.145938 0.152378 0.156350 0.158736 0.157529
qa: -0.0496 -0.0555 -0.2073 -0.2810 -0.4230 -0.3280 -0.0861 0.1488 -0.0310 -0.1426 -0.2828 -0.2741 -0.2173 0.3702 0.0705 0.4160 0.0128 -0.2302 -0.2194 -0.1589 0.1479 -0.1608 0.2671 0.2627 -0.2425 -0.1602 -0.1273 -0.1643 -0.1777 0.1131 0.1153 0.0944 0.1006 0.1026 0.0965 0.1071 0.0903 0.1402 0.1443 0.1464 0.1484 0.1534 0.1459 0.1524 0.1564 0.1587 0.1575
va: 1.2798 1.2504 1.0850 2.1148 2.0864 2.0392 3.1117 3.7133 3.8880 3.8178 3.9103 3.8856 3.9009 4.2088 4.1933 3.7073 3.5929 4.0768 3.9861 3.9567 3.7205 3.9085 4.0013 3.6916 3.9965 3.8729 3.9044 3.9167 3.8950 1.0228 1.0229 0.9989 1.0037 0.9995 1.0134 1.0027 1.0067 1.0079 1.0138 1.0214 0.9996 0.9973 1.0082 1.0026 0.9897 0.9909 0.9902
dispcorr: -0.026173046 hartree
energy: -2149.962238487189
dipole: 0.83272 -1.47235 -0.63964 -32.55696 32.00046 -0.55650 10.08687 -8.84867 1.23820
magnitude: 1.50065 au
magnitude: 3.81435 debye
