program: Orca
programVersion: 5.0.2
elementType: Cl Cl F O O O N C C C C C C C C C C C C C C C C C C C C C C H H H H H H H H H H H H H H H H H H
charge: 0
multiplicity: 1
keywords: wb97x-d3
keywords: def2-TZVPP
keywords: def2/J RIJCOSX
keywords: DEFGRID2
keywords: scfconv7
keywords: smallprint printgap noloewdin
keywords: NOSOSCF
formula: C22H18Cl2FNO3
InChI: InChI=1/C22H18Cl2FNO3/c1-22(2)15(11-19(23)24)20(22)21(27)29-18(12-26)13-8-9-16(25)17(10-13)28-14-6-4-3-5-7-14/h3-11,15,18,20H,1-2H3
47 atoms
Cl -4.597946 0.626663 0.725118
Cl -5.0064 2.469634 2.905117
F  2.426213 -3.368062 1.975874
O  1.445349 2.512845 -0.084025
O  0.126109 1.156034 -1.267285
O  3.255145 -3.1518 -0.604443
N  3.028094 1.734046 -2.977994
C  -1.8270 3.63362 -1.052158
C  -2.251403 2.555876 -0.098552
C  -0.811247 3.032985 -0.097151
C  -2.2030 5.071116 -0.785891
C  -1.801933 3.294126 -2.521929
C  -3.082043 2.832051 1.079607
C  0.247502 2.120453 -0.558173
C  -4.086159 2.074407 1.503669
C  2.571075 1.712196 -0.403315
C  2.509622 0.324515 0.201322
C  2.800261 1.706351 -1.852764
C  2.852657 -0.808784 -0.522975
C  2.138241 0.202256 1.535625
C  2.839439 -2.052734 0.083902
C  2.098747 -1.043496 2.142108
C  2.451653 -2.157632 1.411294
C  2.34055 -4.106472 -0.962433
C  0.973523 -3.870342 -1.005128
C  2.860104 -5.343522 -1.323566
C  0.125018 -4.893143 -1.41059
C  1.999512 -6.35086 -1.728922
C  0.627697 -6.133893 -1.772494
H  -2.402996 1.587236 -0.561258
H  -0.51787 3.68287 0.719606
H  -3.223294 5.267164 -1.120591
H  -2.13778 5.346782 0.266043
H  -1.539199 5.739452 -1.337036
H  -1.020923 3.855036 -3.038752
H  -1.646939 2.235971 -2.719423
H  -2.75724 3.571457 -2.97142
H  -2.862069 3.719777 1.66106
H  3.413695 2.252804 0.0364
H  3.144617 -0.751171 -1.564528
H  1.874789 1.074737 2.119338
H  1.805621 -1.145687 3.178832
H  0.55898 -2.90546 -0.740365
H  3.929536 -5.511032 -1.285693
H  -0.94097 -4.707849 -1.44494
H  2.407327 -7.314034 -2.00806
H  -0.040782 -6.924189 -2.087412
elementType: Cl F O N C H
totalener: -2149.93754573 hartree
nucrepener: 2916.89389874 hartree
electener: -5066.83144447 hartree
oneelecener: -8747.64571669 hartree
twoeener: 3680.81427222 hartree
cpcmener: -0.03430006 hartree
kineticenergy: 2143.45582488 hartree
xcener: -159.160003729933 hartree
chargesum: 0.0000000
charge: -0.054484 -0.059012 -0.207866 -0.291463 -0.436417 -0.321606 -0.076497 0.088045 0.029593 -0.087746 -0.262639 -0.263942 -0.204937 0.408872 0.042635 0.529575 -0.077146 -0.265452 -0.138265 -0.214019 0.130941 -0.164983 0.270298 0.281324 -0.172281 -0.242777 -0.166052 -0.123036 -0.183929 0.082860 0.095250 0.102173 0.089927 0.099346 0.100589 0.094900 0.098720 0.130734 0.146580 0.124624 0.147018 0.151704 0.151350 0.145073 0.158511 0.156480 0.157430
qa: -0.0545 -0.0590 -0.2079 -0.2915 -0.4364 -0.3216 -0.0765 0.0880 0.0296 -0.0877 -0.2626 -0.2639 -0.2049 0.4089 0.0426 0.5296 -0.0771 -0.2655 -0.1383 -0.2140 0.1309 -0.1650 0.2703 0.2813 -0.1723 -0.2428 -0.1661 -0.1230 -0.1839 0.0829 0.0952 0.1022 0.0899 0.0993 0.1006 0.0949 0.0987 0.1307 0.1466 0.1246 0.1470 0.1517 0.1513 0.1451 0.1585 0.1565 0.1574
va: 1.2708 1.2458 1.0846 2.1313 2.0679 2.0791 3.1025 3.7422 3.8700 3.8717 3.9059 3.9079 3.8998 4.1503 4.2134 3.7580 3.7628 4.1080 3.9537 3.9559 3.8429 3.9182 4.0020 3.6826 3.8671 3.9893 3.9194 3.9000 3.9011 1.0462 1.0349 1.0010 1.0058 1.0015 1.0000 1.0184 1.0000 1.0178 0.9882 1.0301 1.0082 0.9983 1.0066 1.0090 0.9910 0.9893 0.9903
dispcorr: -0.023821284 hartree
energy: -2149.961367015916
dipole: 9.39129 -9.57407 -0.18278 7.83257 -5.86978 1.96279 -18.31190 20.00910 1.69720
magnitude: 2.60124 au
magnitude: 6.61183 debye
