program: Orca
programVersion: 5.0.2
elementType: Cl Cl F O O O N C C C C C C C C C C C C C C C C C C C C C C H H H H H H H H H H H H H H H H H H
charge: 0
multiplicity: 1
keywords: wb97x-d3
keywords: def2-TZVPP
keywords: def2/J RIJCOSX
keywords: DEFGRID2
keywords: scfconv7
keywords: smallprint printgap noloewdin
keywords: NOSOSCF
formula: C22H18Cl2FNO3
InChI: InChI=1/C22H18Cl2FNO3/c1-22(2)15(11-19(23)24)20(22)21(27)29-18(12-26)13-8-9-16(25)17(10-13)28-14-6-4-3-5-7-14/h3-11,15,18,20H,1-2H3
47 atoms
Cl -5.031691 2.301226 1.052749
Cl -5.368205 4.423642 -0.871104
F  4.343346 -3.302652 -1.582914
O  1.236626 1.852263 -0.159401
O  -0.1510 0.562174 1.030384
O  3.021441 -3.439262 0.73618
N  4.043348 3.389842 0.689664
C  -1.826271 0.690577 -1.615313
C  -2.427681 1.610693 -0.592735
C  -0.948864 1.711929 -0.912763
C  -2.068629 0.932728 -3.085423
C  -1.733784 -0.775949 -1.269115
C  -3.300391 2.727884 -0.974294
C  0.03866 1.299224 0.097769
C  -4.410397 3.091679 -0.344448
C  2.333036 1.417133 0.642781
C  2.934748 0.161745 0.066848
C  3.284401 2.528852 0.650612
C  2.716106 -1.048895 0.707611
C  3.636794 0.201538 -1.133277
C  3.187541 -2.226279 0.14635
C  4.128261 -0.967352 -1.687234
C  3.88918 -2.167158 -1.048611
C  1.766918 -3.803517 1.157477
C  1.690387 -4.573079 2.308909
C  0.62076 -3.460779 0.451706
C  0.450094 -5.003157 2.757709
C  -0.613037 -3.890456 0.918951
C  -0.70636 -4.659451 2.070798
H  -2.654567 1.139884 0.357218
H  -0.642655 2.550723 -1.527809
H  -1.314243 0.41392 -3.679287
H  -3.045545 0.544953 -3.380073
H  -2.028953 1.985764 -3.361721
H  -0.860501 -1.232108 -1.739868
H  -1.6828 -0.96484 -0.199547
H  -2.617648 -1.291569 -1.649315
H  -3.020522 3.314774 -1.841221
H  2.024679 1.254008 1.679767
H  2.175693 -1.082559 1.645783
H  3.812614 1.140227 -1.643956
H  4.681218 -0.952491 -2.617277
H  2.593524 -4.831795 2.847385
H  0.678116 -2.870288 -0.454264
H  0.39074 -5.603178 3.656582
H  -1.506716 -3.623585 0.36912
H  -1.672233 -4.991115 2.428153
elementType: Cl F O N C H
totalener: -2149.93873175 hartree
nucrepener: 2942.37806273 hartree
electener: -5092.31679448 hartree
oneelecener: -8797.45808268 hartree
twoeener: 3705.14128820 hartree
cpcmener: -0.03206722 hartree
kineticenergy: 2143.46822433 hartree
xcener: -159.160248784838 hartree
chargesum: -0.0000000
charge: -0.054657 -0.059188 -0.205660 -0.277522 -0.443738 -0.329410 -0.087060 0.106347 0.033911 -0.089289 -0.262949 -0.293913 -0.204332 0.402623 0.040681 0.406258 -0.027290 -0.226737 -0.129182 -0.179258 0.169242 -0.176010 0.220594 0.254127 -0.229573 -0.168950 -0.128261 -0.160304 -0.177519 0.082882 0.097988 0.098583 0.102302 0.091351 0.104963 0.092009 0.103017 0.129704 0.134784 0.150061 0.147113 0.152504 0.147191 0.162219 0.157698 0.165293 0.157354
qa: -0.0547 -0.0592 -0.2057 -0.2775 -0.4437 -0.3294 -0.0871 0.1063 0.0339 -0.0893 -0.2629 -0.2939 -0.2043 0.4026 0.0407 0.4063 -0.0273 -0.2267 -0.1292 -0.1793 0.1692 -0.1760 0.2206 0.2541 -0.2296 -0.1690 -0.1283 -0.1603 -0.1775 0.0829 0.0980 0.0986 0.1023 0.0914 0.1050 0.0920 0.1030 0.1297 0.1348 0.1501 0.1471 0.1525 0.1472 0.1622 0.1577 0.1653 0.1574
va: 1.2711 1.2454 1.0884 2.1329 2.0661 2.0821 3.1111 3.7221 3.8726 3.8670 3.9049 3.9107 3.8950 4.1867 4.2140 3.7339 3.6745 4.0678 3.8985 3.9527 3.7340 3.9014 4.0782 3.7366 3.9911 3.8696 3.9011 3.8937 3.9185 1.0453 1.0332 1.0017 1.0011 1.0062 0.9954 1.0133 1.0021 1.0184 1.0193 1.0135 1.0056 0.9979 1.0067 0.9910 0.9886 0.9874 0.9909
dispcorr: -0.025581478 hartree
energy: -2149.964313229901
dipole: 6.13134 -7.06072 -0.92938 -20.03437 19.22086 -0.81351 -7.12248 5.86327 -1.25920
magnitude: 1.76384 au
magnitude: 4.48334 debye
