program: Orca
programVersion: 5.0.2
elementType: Cl Cl F O O O N C C C C C C C C C C C C C C C C C C C C C C H H H H H H H H H H H H H H H H H H
charge: 0
multiplicity: 1
keywords: wb97x-d3
keywords: def2-TZVPP
keywords: def2/J RIJCOSX
keywords: DEFGRID2
keywords: scfconv7
keywords: smallprint printgap noloewdin
keywords: NOSOSCF
formula: C22H18Cl2FNO3
InChI: InChI=1/C22H18Cl2FNO3/c1-22(2)15(11-19(23)24)20(22)21(27)29-18(12-26)13-8-9-16(25)17(10-13)28-14-6-4-3-5-7-14/h3-11,15,18,20H,1-2H3
47 atoms
Cl -3.697474 0.045337 1.156974
Cl -4.561593 1.975301 3.118427
F  2.255732 -3.286958 1.966351
O  1.481696 2.589439 -0.140342
O  0.224196 1.277383 -1.43243
O  3.11426 -3.112155 -0.603506
N  3.190496 1.798003 -2.966098
C  -1.874314 3.601546 -1.094875
C  -2.194573 2.476669 -0.16087
C  -0.787407 3.061014 -0.184935
C  -2.345558 5.002199 -0.784377
C  -1.855561 3.306169 -2.574819
C  -2.995819 2.650626 1.055902
C  0.305421 2.205463 -0.671023
C  -3.659276 1.684691 1.679644
C  2.612965 1.779889 -0.415878
C  2.50135 0.394193 0.185987
C  2.909769 1.769089 -1.852705
C  2.809423 -0.752636 -0.532907
C  2.105116 0.288879 1.514908
C  2.738891 -1.993487 0.076455
C  2.011186 -0.952199 2.124263
C  2.332125 -2.079944 1.399777
C  2.160731 -4.02228 -0.976146
C  0.806391 -3.723919 -1.032339
C  2.626966 -5.280585 -1.337451
C  -0.083418 -4.705228 -1.452236
C  1.725869 -6.245554 -1.757554
C  0.366043 -5.965743 -1.815368
H  -2.274285 1.50699 -0.639011
H  -0.519654 3.708715 0.641939
H  -3.391952 5.125395 -1.071212
H  -2.252881 5.267352 0.268658
H  -1.760036 5.728353 -1.351435
H  -1.646296 2.264489 -2.807751
H  -2.830294 3.546191 -3.00434
H  -1.111994 3.923566 -3.083237
H  -3.040917 3.63721 1.501664
H  3.441469 2.30964 0.062345
H  3.115236 -0.707577 -1.571298
H  1.865544 1.172323 2.092483
H  1.70096 -1.040742 3.157383
H  0.432979 -2.742369 -0.767459
H  3.686916 -5.497772 -1.288115
H  -1.139389 -4.471271 -1.496682
H  2.091915 -7.225361 -2.036783
H  -0.334261 -6.723328 -2.141529
elementType: Cl F O N C H
totalener: -2149.93731422 hartree
nucrepener: 2953.94586288 hartree
electener: -5103.88317711 hartree
oneelecener: -8821.78147754 hartree
twoeener: 3717.89830043 hartree
cpcmener: -0.03419672 hartree
kineticenergy: 2143.45508371 hartree
xcener: -159.160009162593 hartree
chargesum: 0.0000000
charge: -0.053574 -0.059076 -0.207702 -0.292917 -0.438809 -0.321677 -0.076903 0.095363 0.005150 -0.060741 -0.276410 -0.265038 -0.192851 0.400833 0.041962 0.527828 -0.079810 -0.264265 -0.136746 -0.212026 0.130782 -0.166490 0.270472 0.282242 -0.171555 -0.242816 -0.166379 -0.122816 -0.183734 0.086052 0.097228 0.104406 0.092578 0.099234 0.095194 0.098213 0.100975 0.127454 0.146037 0.125125 0.146785 0.151950 0.149786 0.144969 0.158205 0.156425 0.157087
qa: -0.0536 -0.0591 -0.2077 -0.2929 -0.4388 -0.3217 -0.0769 0.0954 0.0051 -0.0607 -0.2764 -0.2650 -0.1929 0.4008 0.0420 0.5278 -0.0798 -0.2643 -0.1367 -0.2120 0.1308 -0.1665 0.2705 0.2822 -0.1716 -0.2428 -0.1664 -0.1228 -0.1837 0.0861 0.0972 0.1044 0.0926 0.0992 0.0952 0.0982 0.1010 0.1275 0.1460 0.1251 0.1468 0.1520 0.1498 0.1450 0.1582 0.1564 0.1571
va: 1.2722 1.2459 1.0850 2.1298 2.0656 2.0798 3.1043 3.7658 3.8849 3.8334 3.9106 3.9046 3.8992 4.1498 4.2181 3.7688 3.7612 4.1064 3.9495 3.9560 3.8453 3.9187 4.0007 3.6828 3.8667 3.9894 3.9200 3.9001 3.9009 1.0451 1.0326 0.9996 1.0053 1.0013 1.0186 0.9998 0.9995 1.0212 0.9885 1.0296 1.0081 0.9981 1.0076 1.0091 0.9910 0.9893 0.9904
dispcorr: -0.024069533 hartree
energy: -2149.961383755915
dipole: 4.91503 -5.45659 -0.54157 10.56818 -8.51734 2.05084 -20.17004 21.81229 1.64225
magnitude: 2.68258 au
magnitude: 6.81858 debye
