program: Orca
programVersion: 5.0.2
elementType: Cl Cl F O O O N C C C C C C C C C C C C C C C C C C C C C C H H H H H H H H H H H H H H H H H H
charge: 0
multiplicity: 1
keywords: wb97x-d3
keywords: def2-TZVPP
keywords: def2/J RIJCOSX
keywords: DEFGRID2
keywords: scfconv7
keywords: smallprint printgap noloewdin
keywords: NOSOSCF
formula: C22H18Cl2FNO3
InChI: InChI=1/C22H18Cl2FNO3/c1-22(2)15(11-19(23)24)20(22)21(27)29-18(12-26)13-8-9-16(25)17(10-13)28-14-6-4-3-5-7-14/h3-11,15,18,20H,1-2H3
47 atoms
Cl -1.623952 5.128417 -1.180368
Cl -4.457085 5.699747 -1.238054
F  2.860944 -2.96709 2.73996
O  0.411031 1.097904 -1.339902
O  0.560134 2.162709 0.618238
O  0.677779 -3.30357 1.137307
N  2.483204 -0.103503 -3.614867
C  -2.502994 1.223561 0.61024
C  -2.349527 2.705573 0.55151
C  -1.57669 1.856195 -0.423879
C  -3.754226 0.594279 0.049587
C  -1.931922 0.481863 1.792341
C  -3.429887 3.585518 0.05466
C  -0.115608 1.754264 -0.289911
C  -3.202777 4.659347 -0.687308
C  1.796778 0.800378 -1.261234
C  2.101948 -0.230399 -0.19907
C  2.158257 0.295083 -2.588044
C  1.27637 -1.340027 -0.053817
C  3.199634 -0.063461 0.629907
C  1.534482 -2.264785 0.940719
C  3.475333 -0.996782 1.618828
C  2.634238 -2.076043 1.771614
C  1.133152 -4.589273 0.995053
C  2.225103 -4.918926 0.204283
C  0.41482 -5.573271 1.6612
C  2.602206 -6.251494 0.097262
C  0.80016 -6.899009 1.537665
C  1.898153 -7.245519 0.760553
H  -1.747923 3.141308 1.345767
H  -1.941905 1.813301 -1.444039
H  -3.565113 -0.441194 -0.238312
H  -4.548872 0.588183 0.798496
H  -4.128985 1.116897 -0.831189
H  -1.641496 -0.533519 1.514883
H  -1.064633 0.972149 2.230977
H  -2.688512 0.404265 2.575626
H  -4.454797 3.364737 0.330474
H  2.388386 1.70526 -1.085842
H  0.417553 -1.493429 -0.696611
H  3.840671 0.801466 0.519161
H  4.32229 -0.873418 2.281111
H  2.780031 -4.160058 -0.333401
H  -0.436305 -5.299883 2.272376
H  3.455623 -6.508534 -0.516932
H  0.240821 -7.663964 2.060776
H  2.199818 -8.280767 0.671518
elementType: Cl F O N C H
totalener: -2149.93673453 hartree
nucrepener: 2933.30051941 hartree
electener: -5083.23725395 hartree
oneelecener: -8780.05252228 hartree
twoeener: 3696.81526834 hartree
cpcmener: -0.03202871 hartree
kineticenergy: 2143.47786942 hartree
xcener: -159.160432410237 hartree
chargesum: 0.0000000
charge: -0.050231 -0.055221 -0.207002 -0.280774 -0.427514 -0.328981 -0.086703 0.143239 -0.035739 -0.134109 -0.282249 -0.273032 -0.213163 0.374158 0.068924 0.418337 0.008050 -0.228584 -0.220230 -0.156889 0.152537 -0.161394 0.266994 0.263668 -0.161762 -0.240424 -0.164913 -0.126747 -0.179357 0.113792 0.113465 0.100059 0.102693 0.094566 0.095580 0.095900 0.103378 0.140524 0.143286 0.142320 0.148630 0.153516 0.153008 0.145212 0.158709 0.156673 0.157798
qa: -0.0502 -0.0552 -0.2070 -0.2808 -0.4275 -0.3290 -0.0867 0.1432 -0.0357 -0.1341 -0.2822 -0.2730 -0.2132 0.3742 0.0689 0.4183 0.0080 -0.2286 -0.2202 -0.1569 0.1525 -0.1614 0.2670 0.2637 -0.1618 -0.2404 -0.1649 -0.1267 -0.1794 0.1138 0.1135 0.1001 0.1027 0.0946 0.0956 0.0959 0.1034 0.1405 0.1433 0.1423 0.1486 0.1535 0.1530 0.1452 0.1587 0.1567 0.1578
va: 1.2802 1.2511 1.0851 2.1193 2.0826 2.0483 3.1114 3.7220 3.8858 3.8169 3.9108 3.8880 3.8998 4.1966 4.1924 3.7066 3.5990 4.0767 3.9914 3.9526 3.7408 3.9095 3.9923 3.6956 3.8672 3.9951 3.9161 3.9041 3.8970 1.0232 1.0236 1.0033 0.9994 0.9989 1.0025 1.0144 1.0027 1.0076 1.0144 1.0238 0.9997 0.9974 1.0023 1.0088 0.9909 0.9894 0.9901
dispcorr: -0.025558554 hartree
energy: -2149.962293088390
dipole: -0.43463 -0.30391 -0.73854 -32.11028 31.70094 -0.40934 10.60479 -9.38251 1.22228
magnitude: 1.48558 au
magnitude: 3.77606 debye
