program: Orca
programVersion: 5.0.2
elementType: Cl Cl F O O O N C C C C C C C C C C C C C C C C C C C C C C H H H H H H H H H H H H H H H H H H
charge: 0
multiplicity: 1
keywords: wb97x-d3
keywords: def2-TZVPP
keywords: def2/J RIJCOSX
keywords: DEFGRID2
keywords: scfconv7
keywords: smallprint printgap noloewdin
keywords: NOSOSCF
formula: C22H18Cl2FNO3
InChI: InChI=1/C22H18Cl2FNO3/c1-22(2)15(11-19(23)24)20(22)21(27)29-18(12-26)13-8-9-16(25)17(10-13)28-14-6-4-3-5-7-14/h3-11,15,18,20H,1-2H3
47 atoms
Cl -4.902608 2.029362 1.293835
Cl -5.289683 4.485841 -0.168017
F  4.222716 -3.152377 -1.899283
O  1.245292 1.877697 0.083337
O  -0.116168 0.262605 0.817627
O  2.982432 -3.514095 0.430496
N  4.040582 3.269688 1.131499
C  -1.742038 1.011071 -1.752564
C  -2.376462 1.661098 -0.558939
C  -0.889459 1.841061 -0.810741
C  -1.948899 1.592322 -3.130463
C  -1.647808 -0.495278 -1.761632
C  -3.248357 2.834818 -0.681011
C  0.072302 1.223686 0.117312
C  -4.3303 3.071915 0.04977
C  2.316684 1.327305 0.84882
C  2.920884 0.137952 0.146702
C  3.276288 2.423169 0.996491
C  2.713295 -1.130284 0.668002
C  3.600182 0.297405 -1.055942
C  3.152966 -2.246171 -0.026336
C  4.064352 -0.812163 -1.741928
C  3.819012 -2.070153 -1.230037
C  1.742854 -3.901011 0.873215
C  0.567033 -3.42576 0.30584
C  1.712098 -4.833712 1.899433
C  -0.648772 -3.889956 0.787365
C  0.488659 -5.295767 2.361724
C  -0.695993 -4.822976 1.813971
H  -2.615953 0.977599 0.24757
H  -0.582313 2.803136 -1.204456
H  -1.176688 1.226665 -3.809529
H  -2.915809 1.285615 -3.533635
H  -1.907083 2.680519 -3.150385
H  -1.670685 -0.936086 -0.767531
H  -2.494801 -0.904288 -2.315468
H  -0.737395 -0.826992 -2.264727
H  -2.991685 3.580497 -1.423909
H  1.982811 1.051201 1.853777
H  2.19249 -1.254281 1.609354
H  3.772627 1.283044 -1.470241
H  4.594977 -0.704509 -2.678901
H  0.586444 -2.707526 -0.50445
H  2.638149 -5.193839 2.32992
H  -1.565824 -3.519752 0.347261
H  0.465687 -6.023511 3.162616
H  -1.64854 -5.179378 2.182795
elementType: Cl F O N C H
totalener: -2149.93847093 hartree
nucrepener: 2946.75962877 hartree
electener: -5096.69809970 hartree
oneelecener: -8806.37584630 hartree
twoeener: 3709.67774660 hartree
cpcmener: -0.03210300 hartree
kineticenergy: 2143.47292171 hartree
xcener: -159.161447750615 hartree
chargesum: 0.0000000
charge: -0.054553 -0.059477 -0.205979 -0.273754 -0.445929 -0.328936 -0.087277 0.101583 0.030813 -0.083500 -0.268136 -0.272978 -0.202555 0.402288 0.041897 0.399155 -0.015647 -0.224065 -0.146224 -0.187014 0.184459 -0.171924 0.215713 0.270327 -0.181803 -0.233240 -0.153289 -0.128098 -0.176011 0.082219 0.097640 0.098769 0.102145 0.091997 0.082284 0.101752 0.104155 0.128137 0.136778 0.148931 0.147327 0.152924 0.161226 0.145957 0.157752 0.157370 0.156791
qa: -0.0546 -0.0595 -0.2060 -0.2738 -0.4459 -0.3289 -0.0873 0.1016 0.0308 -0.0835 -0.2681 -0.2730 -0.2026 0.4023 0.0419 0.3992 -0.0156 -0.2241 -0.1462 -0.1870 0.1845 -0.1719 0.2157 0.2703 -0.1818 -0.2332 -0.1533 -0.1281 -0.1760 0.0822 0.0976 0.0988 0.1021 0.0920 0.0823 0.1018 0.1042 0.1281 0.1368 0.1489 0.1473 0.1529 0.1612 0.1460 0.1578 0.1574 0.1568
va: 1.2711 1.2455 1.0881 2.1370 2.0637 2.0866 3.1113 3.7144 3.8785 3.8538 3.9105 3.9156 3.9005 4.1788 4.2146 3.7543 3.6288 4.0640 3.9116 3.9509 3.7209 3.8956 4.0810 3.7245 3.8722 3.9924 3.9016 3.8978 3.9142 1.0448 1.0328 1.0012 1.0006 1.0060 1.0161 1.0024 0.9971 1.0198 1.0150 1.0125 1.0062 0.9974 0.9912 1.0073 0.9915 0.9889 0.9907
dispcorr: -0.025510139 hartree
energy: -2149.963981067031
dipole: 6.26491 -7.20143 -0.93652 -17.30932 16.86550 -0.44382 -10.62317 9.34795 -1.27522
magnitude: 1.64324 au
magnitude: 4.17678 debye
