program: Orca
programVersion: 5.0.2
elementType: Cl Cl F O O O N C C C C C C C C C C C C C C C C C C C C C C H H H H H H H H H H H H H H H H H H
charge: 0
multiplicity: 1
keywords: wb97x-d3
keywords: def2-TZVPP
keywords: def2/J RIJCOSX
keywords: DEFGRID2
keywords: scfconv7
keywords: smallprint printgap noloewdin
keywords: NOSOSCF
formula: C22H18Cl2FNO3
InChI: InChI=1/C22H18Cl2FNO3/c1-22(2)15(11-19(23)24)20(22)21(27)29-18(12-26)13-8-9-16(25)17(10-13)28-14-6-4-3-5-7-14/h3-11,15,18,20H,1-2H3
47 atoms
Cl -1.059224 0.393066 2.058149
Cl -3.324766 1.039802 3.735923
F  2.104142 -3.213488 1.346699
O  1.363244 2.781876 -0.141617
O  0.133442 1.655205 -1.622036
O  2.174683 -2.784297 -1.354364
N  3.094957 2.373025 -3.055993
C  -2.164519 3.612009 -0.683924
C  -2.259114 2.304043 0.015939
C  -0.934719 3.045044 0.01101
C  -2.748201 4.83809 -0.025891
C  -2.253076 3.637221 -2.189215
C  -2.961364 2.118609 1.30395
C  0.190972 2.418874 -0.69259
C  -2.512878 1.294313 2.241048
C  2.519969 2.050841 -0.526656
C  2.443411 0.61165 -0.073219
C  2.803716 2.211872 -1.956814
C  2.326346 -0.45226 -0.957076
C  2.432797 0.375737 1.296976
C  2.218168 -1.745764 -0.476661
C  2.311507 -0.914814 1.786707
C  2.211222 -1.96121 0.895318
C  1.085649 -3.616921 -1.36235
C  -0.169325 -3.224602 -0.917336
C  1.290706 -4.887682 -1.883134
C  -1.221339 -4.12869 -0.987991
C  0.228218 -5.774869 -1.952733
C  -1.03168 -5.403428 -1.501318
H  -2.278915 1.43298 -0.635006
H  -0.665342 3.545189 0.934228
H  -3.812158 4.925653 -0.254771
H  -2.640368 4.826257 1.059345
H  -2.255572 5.739239 -0.394996
H  -3.289915 3.79821 -2.490339
H  -1.660691 4.456526 -2.600371
H  -1.919155 2.712723 -2.654728
H  -3.886617 2.652607 1.489386
H  3.337163 2.549045 0.000785
H  2.323223 -0.301745 -2.029581
H  2.520478 1.197961 1.995751
H  2.307452 -1.108636 2.85146
H  -0.343328 -2.229751 -0.525425
H  2.275839 -5.176859 -2.227523
H  -2.199913 -3.824315 -0.639534
H  0.391647 -6.765837 -2.356391
H  -1.857453 -6.100862 -1.550972
elementType: Cl F O N C H
totalener: -2149.93481266 hartree
nucrepener: 3080.42105181 hartree
electener: -5230.35586448 hartree
oneelecener: -9074.87438167 hartree
twoeener: 3844.51851719 hartree
cpcmener: -0.03278089 hartree
kineticenergy: 2143.48518602 hartree
xcener: -159.164916250886 hartree
chargesum: -0.0000000
charge: -0.055058 -0.055308 -0.206300 -0.283727 -0.442529 -0.323024 -0.079282 0.132670 -0.045261 -0.103728 -0.278305 -0.269008 -0.221223 0.388968 0.088799 0.483201 -0.020391 -0.253008 -0.118940 -0.261957 0.113063 -0.173398 0.286955 0.274010 -0.159330 -0.239963 -0.162639 -0.124338 -0.181638 0.117848 0.109105 0.102388 0.093097 0.099952 0.096484 0.100834 0.095199 0.142038 0.145200 0.127781 0.147508 0.155166 0.143572 0.144081 0.156358 0.156931 0.157148
qa: -0.0551 -0.0553 -0.2063 -0.2837 -0.4425 -0.3230 -0.0793 0.1327 -0.0453 -0.1037 -0.2783 -0.2690 -0.2212 0.3890 0.0888 0.4832 -0.0204 -0.2530 -0.1189 -0.2620 0.1131 -0.1734 0.2870 0.2740 -0.1593 -0.2400 -0.1626 -0.1243 -0.1816 0.1178 0.1091 0.1024 0.0931 0.1000 0.0965 0.1008 0.0952 0.1420 0.1452 0.1278 0.1475 0.1552 0.1436 0.1441 0.1564 0.1569 0.1571
va: 1.2953 1.2514 1.0860 2.1274 2.0600 2.0796 3.1085 3.7362 3.8755 3.8349 3.9094 3.8898 3.9088 4.1397 4.1751 3.8274 3.6289 4.0798 3.9457 3.9268 3.8740 3.8422 3.9639 3.6759 3.8660 3.9943 3.9156 3.8996 3.8989 1.0225 1.0262 0.9994 0.9994 1.0028 1.0012 0.9994 1.0181 1.0073 0.9911 1.0311 1.0084 0.9966 1.0111 1.0091 0.9915 0.9891 0.9902
dispcorr: -0.027256180 hartree
energy: -2149.962068844885
dipole: -9.37408 8.10987 -1.26421 12.08362 -10.65250 1.43112 -19.24726 21.27691 2.02965
magnitude: 2.78672 au
magnitude: 7.08328 debye
