program: Gaussian 09
title: 000060533
version: EM64L-G09RevD.01
frameworkgroup: C1[X(C17H27N3)]
method: RPBEPBE
basis: SDD
operation: Freq
keyword: #pfreq=noraman
keyword: PBEPBE/SDD
title: #p freq=noraman PBEPBE/SDD
converged: YES YES NO NO
title: Mulliken charges:
elementType: N N N C C C C C C C C C C C C C C C C C H H H H H H H H H H H H H H H H H H H H H H H H H H H
charge: -0.218695 -0.096809 -0.112640 -0.223273 -0.391981 -0.537940 -0.364560 0.236567 0.518442 -0.323787 -0.328261 -0.775507 -0.464686 -0.383165 -0.412986 -0.360781 0.435390 -0.673740 -0.669839 -0.807641 0.223659 0.212100 0.245157 0.224559 0.234316 0.206025 0.201874 0.192116 0.202037 0.189462 0.203863 0.221902 0.229752 0.266234 0.226625 0.247549 0.228072 0.227375 0.206936 0.227486 0.208989 0.205340 0.229184 0.211336 0.229153 0.231647 0.223141
chargesum: 0.00000
title: Mulliken charges with hydrogens summed into heavy atoms:
elementType: N N N C C C C C C C C C C C C C C C C C
charge: -0.218695 -0.096809 -0.112640 0.000387 0.065276 -0.079064 0.043339 0.236567 0.518442 0.070366 0.065063 -0.057619 -0.238061 -0.135616 -0.184914 -0.133406 0.435390 -0.030328 -0.023978 -0.123701
polarizability: 2.25019143e+02 2.66271010e+01 2.14064366e+02 5.00466612e-01 3.75975299e+00 1.75756518e+02
1716.lowfreq: -8.8889 -6.4088 -0.0006 -0.0004 0.0004 6.3736 15.5074 16.9524 29.8495
frequency: 15.3718 16.6993 29.8022 41.2200 43.4093 50.6284 67.6519 72.9868 85.2279 89.0838 141.8729 161.1762 180.3598 191.2104 211.2292 233.3961 248.8152 260.3905 271.2400 287.1555 298.8475 322.4669 347.6194 370.3374 391.8662 406.8846 436.5721 445.7771 482.5507 527.8692 541.2908 564.8038 632.1236 647.8304 672.4623 720.6834 734.5248 752.5551 768.1195 787.2221 794.7512 801.8551 824.0924 840.2575 853.0209 912.3314 914.3243 934.7655 951.8682 976.7148 980.8224 983.8885 987.2204 1011.1548 1018.7432 1024.1555 1041.2375 1047.6259 1048.7121 1071.3157 1074.9550 1081.7607 1084.4980 1120.1145 1126.1147 1161.9297 1185.0317 1189.3370 1206.6619 1211.7881 1221.5064 1227.3730 1249.4092 1262.5586 1279.2860 1283.9741 1287.3113 1292.3276 1303.7295 1326.9038 1329.0269 1358.7803 1366.0360 1377.2107 1379.7251 1386.3296 1386.8268 1387.8302 1396.4821 1407.7556 1420.5326 1452.0884 1460.3527 1461.6025 1463.7749 1470.0543 1470.2285 1470.5257 1473.0961 1476.0673 1478.6539 1484.4140 1486.1524 1490.0210 1507.1661 1586.0486 1595.6437 1624.8363 2852.0523 2858.3166 2875.3877 2919.4386 2975.5072 2981.0754 2983.6196 2984.7493 2991.9933 3006.0678 3015.4843 3031.1781 3036.7000 3054.0123 3060.0828 3060.6313 3067.0219 3073.0867 3077.5102 3082.5881 3092.0886 3092.9067 3105.6156 3113.0613 3127.1871 3131.5716 3139.8975
redmass: 3.5828 3.7586 3.5068 3.3941 3.6268 1.0725 2.8831 2.7517 2.2409 2.8627 3.0936 1.7534 1.2293 2.2465 1.2792 1.9315 1.6969 3.2875 2.4112 2.0565 2.7088 3.2923 2.7543 3.7026 2.8913 2.8536 2.8053 2.7948 2.6941 3.5530 2.8194 4.0526 6.2131 4.5269 4.0412 3.3072 3.1405 2.3339 1.5254 2.3257 1.1465 1.4819 1.5203 4.0165 1.2545 1.9576 2.6510 2.3151 1.4187 1.5619 2.3656 1.4897 2.3562 2.6558 2.5364 3.0798 2.0539 1.5577 1.6605 2.5559 1.8627 1.9471 2.2029 1.3174 1.7277 1.3193 1.2131 1.6373 2.3177 2.3409 2.8731 3.4492 1.5983 1.3213 1.1710 1.2483 1.4224 1.3185 1.2739 1.3350 1.5076 1.3469 1.3385 1.4272 2.5870 1.2511 1.2361 1.3779 1.2701 2.9303 2.4056 1.0801 1.0833 1.0630 1.0758 1.0463 1.0713 1.0464 1.1085 1.1084 1.0610 1.0764 1.0702 1.0763 2.7417 5.9966 6.2290 6.4088 1.0719 1.0714 1.0710 1.0843 1.0371 1.0359 1.0390 1.0358 1.0635 1.0600 1.0871 1.0874 1.0888 1.0976 1.1013 1.0976 1.1029 1.0985 1.0982 1.0988 1.1002 1.1004 1.0874 1.0873 1.0970 1.0958 1.0965
irintensity: 0.2040 0.1363 0.0374 0.4321 0.3508 0.4301 0.4394 0.3571 0.0518 0.1742 0.6791 0.9043 2.0232 0.9790 0.1194 5.7794 0.6071 0.1476 5.3420 0.3724 3.3409 2.1047 1.2475 1.9402 11.4549 0.1981 1.0287 1.3128 5.9082 6.8681 22.1788 5.8187 4.2914 13.7048 1.4546 4.2138 2.5723 11.6367 5.6710 3.9407 4.2707 3.8712 42.4305 5.6322 0.5238 1.7313 37.8309 0.9122 7.5135 8.2553 27.5983 1.9638 5.4060 4.4398 1.1709 4.0661 4.7669 10.3740 6.2574 36.1669 11.1278 37.5410 3.9907 12.5930 7.2426 11.6658 16.3856 30.3254 23.6870 9.8702 0.4857 16.7236 81.5060 18.9036 11.9350 7.6571 9.2383 21.5594 8.1314 0.3709 6.9669 2.2978 5.8846 8.7504 23.6122 22.4273 19.8024 20.4946 6.3719 36.2835 114.7785 21.9020 2.9078 4.8165 1.7598 13.0124 1.5921 14.9463 3.1633 10.1476 3.1228 17.1626 9.5603 10.0577 35.1521 1.6503 138.1607 0.5297 32.0829 109.9441 146.6392 44.1539 41.5102 27.1757 25.3492 32.8709 52.3074 30.7472 22.3759 17.1644 13.5123 21.4840 34.4955 16.4116 32.5921 63.7886 60.3647 19.5423 29.8105 49.1933 14.8353 16.2670 11.5672 38.2098 3.6010
temp: 298.150 k
press: 1.00000 atm
elementType: 7 7 7 6 6 6 6 6 6 6 6 6 6 6 6 6 6 6 6 6 1 1 1 1 1 1 1 1 1 1 1 1 1 1 1 1 1 1 1 1 1 1 1 1 1 1 1
symmnumber: 1
zpe: 1071751.5 jmol-1
zpe.correction: 0.408209 hartree
zpe.thermalcorrener: 0.430552 hartree
zpe.thermalcorrenthalpy: 0.431496 hartree
zpe.thermalcorrgfe: 0.352953 hartree
zpe.sumelectzpe: -826.691584 hartree
zpe.sumelectthermal: -826.669240 hartree
zpe.sumelectthermalent: -826.668296 hartree
zpe.sumelectthermalfe: -826.746840 hartree
dipole: 1.2926 -3.2776 0.2944
dipole: 3.5356
quadrupole: -110.8049 -137.5737 -117.2701
quadrupole: 7.3175 -1.8140 6.6466
quadrupole: 11.0780 -15.6908 4.6128 7.3175 -1.8140 6.6466
hfenergy: -827.0997921 hartree
pointgroup: C01 [X(C17H27N3)]
dipole: 0.6218685 1.2407884 0.0927078 debye
polarizability: 218.3716548|-24.2394389|214.0136262|-12.0693274|16.5848472|182.4547462 unknown
charge 0 multiplicity 1
47 atoms
N  0.21863 -1.44296 -0.420316
N  3.278228 0.836423 -0.207436
N  -0.505277 -3.628886 -0.198395
C  -0.714252 -1.341257 0.739199
C  1.151678 -0.366217 -0.761845
C  -1.337539 -2.796073 0.731994
C  2.316616 -0.19242 0.253555
C  0.321628 -2.794326 -0.80241
C  -1.73229 -0.217967 0.610287
C  4.314095 0.283189 -1.121042
C  3.839675 1.66687 0.891398
C  1.292081 -3.229413 -1.867903
C  -2.024691 0.622037 1.710151
C  -2.440039 -0.010361 -0.602198
C  -3.006861 1.634524 1.609286
C  -3.413737 1.002758 -0.70273
C  -3.719129 1.842906 0.402675
C  4.886467 1.331551 -2.094429
C  2.833268 2.702577 1.428328
C  -4.776294 2.927905 0.285274
H  -0.138757 -1.182752 1.678137
H  1.568147 -0.561968 -1.766345
H  0.60239 0.590731 -0.829195
H  -1.348459 -3.242312 1.740935
H  -2.380299 -2.770796 0.361282
H  1.894759 0.120584 1.225893
H  2.807173 -1.182947 0.423541
H  5.147388 -0.196993 -0.547149
H  3.8429 -0.523657 -1.714237
H  4.21648 1.031424 1.732813
H  4.717588 2.206765 0.492124
H  2.336501 -2.987888 -1.595002
H  1.075215 -2.736716 -2.834064
H  1.20089 -4.317663 -1.998408
H  -1.483471 0.482729 2.655294
H  -2.211767 -0.645191 -1.466852
H  -3.218814 2.27271 2.475829
H  -3.947936 1.149394 -1.650187
H  5.628853 0.867034 -2.770183
H  4.074992 1.767565 -2.702604
H  5.3916 2.156903 -1.561189
H  3.288601 3.301401 2.239345
H  2.518698 3.381898 0.617342
H  1.925257 2.221621 1.835866
H  -4.550487 3.622499 -0.545437
H  -5.77474 2.495306 0.083809
H  -4.849859 3.523061 1.2118
