program: Orca
programVersion: 5.0.2
elementType: Cl Cl F O O O N C C C C C C C C C C C C C C C C C C C C C C H H H H H H H H H H H H H H H H H H
charge: 0
multiplicity: 1
keywords: wb97x-d3
keywords: def2-TZVPP
keywords: def2/J RIJCOSX
keywords: DEFGRID2
keywords: scfconv7
keywords: smallprint printgap noloewdin
keywords: NOSOSCF
formula: C22H18Cl2FNO3
InChI: InChI=1/C22H18Cl2FNO3/c1-22(2)15(11-19(23)24)20(22)21(27)29-18(12-26)13-8-9-16(25)17(10-13)28-14-6-4-3-5-7-14/h3-11,15,18,20H,1-2H3
47 atoms
Cl -1.598101 4.977602 -1.671218
Cl -4.393912 5.705515 -1.631991
F  2.780844 -2.946762 2.852406
O  0.276579 1.001249 -1.282692
O  0.575571 2.22251 0.56382
O  0.679149 -3.436973 1.18378
N  2.191493 -0.327376 -3.622008
C  -2.514802 1.509712 0.842296
C  -2.303251 2.951237 0.528519
C  -1.626618 1.912976 -0.330687
C  -3.820139 0.857862 0.459307
C  -1.908021 0.943963 2.101735
C  -3.372292 3.7944 -0.050655
C  -0.165797 1.762499 -0.265873
C  -3.152562 4.703337 -0.989659
C  1.658964 0.671496 -1.2666
C  1.988764 -0.32349 -0.180238
C  1.935716 0.113534 -2.592538
C  1.213426 -1.469248 -0.032584
C  3.046728 -0.081886 0.681435
C  1.484696 -2.357409 0.991068
C  3.333262 -0.975077 1.70372
C  2.542765 -2.092067 1.854836
C  1.200328 -4.698291 1.056874
C  2.332971 -4.975486 0.303665
C  0.50704 -5.716375 1.698534
C  2.775856 -6.288973 0.209572
C  0.95855 -7.022381 1.588552
C  2.097277 -7.316168 0.848716
H  -1.636677 3.479276 1.206482
H  -2.057514 1.725434 -1.307852
H  -3.688507 -0.21977 0.347171
H  -4.571447 1.018788 1.235273
H  -4.223073 1.238385 -0.479992
H  -1.636272 -0.105001 1.968409
H  -1.022533 1.483305 2.432149
H  -2.638129 0.993339 2.911892
H  -4.382245 3.69057 0.329786
H  2.279383 1.566916 -1.155306
H  0.385978 -1.679616 -0.700308
H  3.648411 0.810665 0.569426
H  4.148415 -0.793243 2.39191
H  2.869415 -4.190779 -0.215661
H  -0.376977 -5.484646 2.279805
H  3.660663 -6.504711 -0.375644
H  0.418124 -7.813653 2.092322
H  2.449966 -8.336213 0.770182
elementType: Cl F O N C H
totalener: -2149.93721801 hartree
nucrepener: 2920.93987621 hartree
electener: -5070.87709422 hartree
oneelecener: -8755.35822591 hartree
twoeener: 3684.48113169 hartree
cpcmener: -0.03167754 hartree
kineticenergy: 2143.47059211 hartree
xcener: -159.158761876061 hartree
chargesum: 0.0000000
charge: -0.050191 -0.054813 -0.206445 -0.281018 -0.433458 -0.326477 -0.087491 0.136995 -0.031469 -0.133977 -0.281296 -0.270246 -0.215839 0.380782 0.072282 0.422608 -0.001618 -0.228753 -0.203298 -0.153339 0.137724 -0.161670 0.265912 0.265935 -0.163169 -0.238775 -0.164522 -0.125393 -0.180854 0.113130 0.114049 0.099819 0.102247 0.094188 0.098638 0.095210 0.099992 0.139692 0.141449 0.140239 0.149560 0.153443 0.152304 0.144904 0.158783 0.156438 0.157785
qa: -0.0502 -0.0548 -0.2064 -0.2810 -0.4335 -0.3265 -0.0875 0.1370 -0.0315 -0.1340 -0.2813 -0.2702 -0.2158 0.3808 0.0723 0.4226 -0.0016 -0.2288 -0.2033 -0.1533 0.1377 -0.1617 0.2659 0.2659 -0.1632 -0.2388 -0.1645 -0.1254 -0.1809 0.1131 0.1140 0.0998 0.1022 0.0942 0.0986 0.0952 0.1000 0.1397 0.1414 0.1402 0.1496 0.1534 0.1523 0.1449 0.1588 0.1564 0.1578
va: 1.2799 1.2515 1.0861 2.1227 2.0790 2.0596 3.1117 3.7245 3.8805 3.8236 3.9131 3.8927 3.9037 4.1839 4.1894 3.7104 3.6066 4.0775 4.0025 3.9379 3.7742 3.9079 3.9918 3.6951 3.8658 3.9908 3.9155 3.9027 3.8979 1.0231 1.0236 1.0032 0.9994 0.9993 0.9996 1.0155 1.0023 1.0081 1.0149 1.0243 1.0003 0.9975 1.0024 1.0090 0.9909 0.9894 0.9901
dispcorr: -0.025115605 hartree
energy: -2149.962333616679
dipole: -0.10434 -0.57731 -0.68165 -29.73904 29.54269 -0.19634 14.63453 -13.18851 1.44602
magnitude: 1.61064 au
magnitude: 4.09393 debye
