program: Orca
programVersion: 5.0.2
elementType: Cl Cl F O O O N C C C C C C C C C C C C C C C C C C C C C C H H H H H H H H H H H H H H H H H H
charge: 0
multiplicity: 1
keywords: wb97x-d3
keywords: def2-TZVPP
keywords: def2/J RIJCOSX
keywords: DEFGRID2
keywords: scfconv7
keywords: smallprint printgap noloewdin
keywords: NOSOSCF
formula: C22H18Cl2FNO3
InChI: InChI=1/C22H18Cl2FNO3/c1-22(2)15(11-19(23)24)20(22)21(27)29-18(12-26)13-8-9-16(25)17(10-13)28-14-6-4-3-5-7-14/h3-11,15,18,20H,1-2H3
47 atoms
Cl -1.543253 4.88336 -1.833069
Cl -4.302561 5.735671 -1.785166
F  2.837533 -2.92608 2.877362
O  0.203024 0.965691 -1.235921
O  0.577581 2.23156 0.565891
O  0.719176 -3.471281 1.244783
N  2.009904 -0.450803 -3.603793
C  -2.523778 1.662839 0.953331
C  -2.270244 3.071127 0.537674
C  -1.653142 1.952201 -0.265003
C  -3.861348 1.036049 0.64673
C  -1.905022 1.15821 2.232423
C  -3.319894 3.913202 -0.077903
C  -0.195104 1.766353 -0.231718
C  -3.0892 4.729734 -1.096042
C  1.582568 0.624331 -1.261479
C  1.946315 -0.34477 -0.163621
C  1.802133 0.020082 -2.577465
C  1.196464 -1.50377 0.006042
C  3.00953 -0.071341 0.681719
C  1.500252 -2.377434 1.033164
C  3.328233 -0.9492 1.708145
C  2.564627 -2.082444 1.879224
C  1.263617 -4.723172 1.120465
C  2.401576 -4.982011 0.368792
C  0.587942 -5.751364 1.764215
C  2.868346 -6.287389 0.279217
C  1.063083 -7.049209 1.658296
C  2.207768 -7.324614 0.920656
H  -1.567919 3.618777 1.16181
H  -2.116757 1.717065 -1.216391
H  -3.771484 -0.050664 0.601573
H  -4.583874 1.274391 1.429855
H  -4.276434 1.371786 -0.304141
H  -1.669841 0.094565 2.158493
H  -0.994957 1.687958 2.508583
H  -2.613828 1.280955 3.053618
H  -4.320775 3.888496 0.338308
H  2.213654 1.517111 -1.200417
H  0.365356 -1.737344 -0.649621
H  3.591649 0.831761 0.5519
H  4.148541 -0.74382 2.383882
H  2.924063 -4.189374 -0.152323
H  -0.300906 -5.533488 2.343469
H  3.757702 -6.488767 -0.304332
H  0.53597 -7.848398 2.163367
H  2.578953 -8.338301 0.845323
elementType: Cl F O N C H
totalener: -2149.93727616 hartree
nucrepener: 2917.06915119 hartree
electener: -5067.00642736 hartree
oneelecener: -8747.66062891 hartree
twoeener: 3680.65420156 hartree
cpcmener: -0.03155540 hartree
kineticenergy: 2143.47713489 hartree
xcener: -159.160019108201 hartree
chargesum: -0.0000000
charge: -0.050184 -0.054870 -0.206265 -0.280796 -0.435493 -0.325084 -0.086390 0.133480 -0.028734 -0.136221 -0.280357 -0.269506 -0.219451 0.384631 0.075345 0.425711 -0.009786 -0.230097 -0.192442 -0.152029 0.128887 -0.162061 0.264980 0.269999 -0.164701 -0.239461 -0.163755 -0.124621 -0.181939 0.112927 0.114692 0.100133 0.101953 0.094118 0.099425 0.095127 0.099032 0.140179 0.140908 0.140027 0.149733 0.153120 0.151988 0.144988 0.158841 0.156326 0.157693
qa: -0.0502 -0.0549 -0.2063 -0.2808 -0.4355 -0.3251 -0.0864 0.1335 -0.0287 -0.1362 -0.2804 -0.2695 -0.2195 0.3846 0.0753 0.4257 -0.0098 -0.2301 -0.1924 -0.1520 0.1289 -0.1621 0.2650 0.2700 -0.1647 -0.2395 -0.1638 -0.1246 -0.1819 0.1129 0.1147 0.1001 0.1020 0.0941 0.0994 0.0951 0.0990 0.1402 0.1409 0.1400 0.1497 0.1531 0.1520 0.1450 0.1588 0.1563 0.1577
va: 1.2802 1.2513 1.0863 2.1249 2.0776 2.0664 3.1122 3.7267 3.8743 3.8311 3.9144 3.8929 3.9073 4.1715 4.1862 3.7126 3.6102 4.0777 4.0048 3.9326 3.7932 3.9086 3.9913 3.6912 3.8667 3.9901 3.9152 3.9022 3.8993 1.0233 1.0232 1.0031 0.9996 0.9993 0.9992 1.0159 1.0023 1.0082 1.0147 1.0240 1.0008 0.9976 1.0027 1.0089 0.9908 0.9894 0.9902
dispcorr: -0.024952440 hartree
energy: -2149.962228603180
dipole: -0.31380 -0.33717 -0.65097 -28.41118 28.36842 -0.04276 16.23157 -14.72483 1.50674
magnitude: 1.64191 au
magnitude: 4.17341 debye
