program: Orca
programVersion: 5.0.2
elementType: Cl Cl F O O O N C C C C C C C C C C C C C C C C C C C C C C H H H H H H H H H H H H H H H H H H
charge: 0
multiplicity: 1
keywords: wb97x-d3
keywords: def2-TZVPP
keywords: def2/J RIJCOSX
keywords: DEFGRID2
keywords: scfconv7
keywords: smallprint printgap noloewdin
keywords: NOSOSCF
formula: C22H18Cl2FNO3
InChI: InChI=1/C22H18Cl2FNO3/c1-22(2)15(11-19(23)24)20(22)21(27)29-18(12-26)13-8-9-16(25)17(10-13)28-14-6-4-3-5-7-14/h3-11,15,18,20H,1-2H3
47 atoms
Cl -4.253797 2.549995 0.441377
Cl -5.170526 5.269741 0.105769
F  4.875752 -2.087535 -1.027041
O  -0.367802 1.028067 0.668215
O  -1.068994 0.421965 -1.365645
O  2.910304 -3.851341 -0.728169
N  0.100617 -0.473769 3.564236
C  -0.71282 3.511059 -1.944662
C  -2.149316 3.210462 -1.696368
C  -1.116649 2.728909 -0.700972
C  -0.197517 4.903709 -1.674773
C  -0.018305 2.827892 -3.09589
C  -3.109695 4.25539 -1.278078
C  -0.869572 1.288077 -0.554365
C  -4.055243 4.051329 -0.372378
C  -0.051844 -0.319262 0.959635
C  1.269699 -0.760337 0.368631
C  0.021212 -0.38707 2.422058
C  1.446717 -2.104806 0.074056
C  2.306635 0.143013 0.177385
C  2.671829 -2.558256 -0.390065
C  3.525121 -0.301572 -0.312182
C  3.699307 -1.643266 -0.57646
C  2.501477 -4.859754 0.106814
C  2.524731 -4.738387 1.490344
C  2.105913 -6.044316 -0.497093
C  2.135083 -5.819487 2.268383
C  1.730047 -7.119234 0.294958
C  1.73592 -7.011138 1.67891
H  -2.575502 2.427791 -2.319723
H  -1.048752 3.288688 0.224685
H  -0.670908 5.369056 -0.809438
H  0.877251 4.881312 -1.48695
H  -0.368302 5.550727 -2.537405
H  -0.456948 1.866165 -3.352291
H  -0.081222 3.460859 -3.983064
H  1.039743 2.671215 -2.878396
H  -3.056572 5.231847 -1.746138
H  -0.851699 -0.996001 0.639605
H  0.63015 -2.804158 0.211749
H  2.183805 1.193445 0.405101
H  4.343072 0.389323 -0.469725
H  2.846079 -3.82051 1.966758
H  2.096872 -6.123039 -1.577048
H  2.151371 -5.725555 3.34661
H  1.422442 -8.043091 -0.17762
H  1.434212 -7.849121 2.293215
elementType: Cl F O N C H
totalener: -2149.93654728 hartree
nucrepener: 2886.67631814 hartree
electener: -5036.61286542 hartree
oneelecener: -8686.62285264 hartree
twoeener: 3650.00998722 hartree
cpcmener: -0.03228859 hartree
kineticenergy: 2143.47553062 hartree
xcener: -159.161295502481 hartree
chargesum: -0.0000000
charge: -0.049886 -0.054141 -0.207466 -0.283495 -0.437353 -0.325973 -0.086310 0.137503 -0.037911 -0.136749 -0.279599 -0.268630 -0.208029 0.386120 0.071313 0.399964 0.013012 -0.225483 -0.173427 -0.180154 0.179674 -0.177115 0.218264 0.274163 -0.176698 -0.244893 -0.150742 -0.120831 -0.183302 0.115754 0.113034 0.094314 0.099464 0.102080 0.095453 0.098299 0.098253 0.139426 0.142440 0.150001 0.148853 0.151494 0.155715 0.147330 0.159921 0.157902 0.158443
qa: -0.0499 -0.0541 -0.2075 -0.2835 -0.4374 -0.3260 -0.0863 0.1375 -0.0379 -0.1367 -0.2796 -0.2686 -0.2080 0.3861 0.0713 0.4000 0.0130 -0.2255 -0.1734 -0.1802 0.1797 -0.1771 0.2183 0.2742 -0.1767 -0.2449 -0.1507 -0.1208 -0.1833 0.1158 0.1130 0.0943 0.0995 0.1021 0.0955 0.0983 0.0983 0.1394 0.1424 0.1500 0.1489 0.1515 0.1557 0.1473 0.1599 0.1579 0.1584
va: 1.2813 1.2523 1.0855 2.1074 2.0737 2.0825 3.1136 3.7177 3.8919 3.8322 3.9160 3.8902 3.9025 4.1486 4.1863 3.7262 3.6602 4.0668 3.9741 3.9140 3.7226 3.9025 4.0631 3.7026 3.8906 3.9987 3.8986 3.8886 3.9052 1.0212 1.0248 0.9990 1.0031 0.9997 1.0175 1.0016 1.0002 1.0080 1.0209 1.0032 1.0105 0.9982 0.9980 1.0072 0.9903 0.9890 0.9902
dispcorr: -0.024450190 hartree
energy: -2149.960997467662
dipole: 18.12002 -17.98675 0.13327 -7.45579 8.63709 1.18130 -10.52807 9.21570 -1.31237
magnitude: 1.77075 au
magnitude: 4.50089 debye
