program: Orca
programVersion: 5.0.2
elementType: Cl Cl F O O O N C C C C C C C C C C C C C C C C C C C C C C H H H H H H H H H H H H H H H H H H
charge: 0
multiplicity: 1
keywords: wb97x-d3
keywords: def2-TZVPP
keywords: def2/J RIJCOSX
keywords: DEFGRID2
keywords: scfconv7
keywords: smallprint printgap noloewdin
keywords: NOSOSCF
formula: C22H18Cl2FNO3
InChI: InChI=1/C22H18Cl2FNO3/c1-22(2)15(11-19(23)24)20(22)21(27)29-18(12-26)13-8-9-16(25)17(10-13)28-14-6-4-3-5-7-14/h3-11,15,18,20H,1-2H3
47 atoms
Cl -2.916875 2.413801 -2.454038
Cl -5.682702 2.78126 -1.708607
F  4.946759 -2.492346 2.221681
O  0.404145 0.964946 -0.313917
O  0.632293 3.195725 -0.343184
O  2.541143 -3.37061 1.602094
N  1.267846 -0.365691 -3.237028
C  -1.752222 3.03541 1.713901
C  -2.234574 3.442331 0.365775
C  -1.377248 2.202132 0.49343
C  -2.718122 2.370378 2.663717
C  -0.720858 3.88937 2.407548
C  -3.651954 3.311156 -0.038123
C  -0.025757 2.221164 -0.086471
C  -4.032426 2.888047 -1.234953
C  1.675215 0.777939 -0.920616
C  2.550083 -0.092562 -0.056339
C  1.436036 0.143689 -2.22136
C  2.088469 -1.33781 0.360976
C  3.812093 0.347426 0.307622
C  2.902468 -2.155701 1.125138
C  4.628133 -0.462033 1.086368
C  4.170127 -1.698143 1.478698
C  1.627429 -4.14312 0.9287
C  1.700288 -4.345387 -0.443632
C  0.654731 -4.770724 1.691439
C  0.771618 -5.178264 -1.050965
C  -0.258111 -5.612677 1.07172
C  -0.209189 -5.81357 -0.300685
H  -1.724003 4.297184 -0.071172
H  -1.887357 1.248547 0.420525
H  -3.437483 1.729527 2.152837
H  -2.181133 1.751827 3.384585
H  -3.278915 3.119839 3.225249
H  -0.091639 4.448127 1.719414
H  -1.221781 4.614195 3.05114
H  -0.07338 3.281409 3.041549
H  -4.422827 3.604536 0.665568
H  2.172138 1.733584 -1.107958
H  1.096899 -1.674311 0.082035
H  4.168809 1.317598 -0.012682
H  5.617549 -0.136415 1.379867
H  2.467565 -3.865704 -1.03892
H  0.618003 -4.606118 2.761242
H  0.822116 -5.333309 -2.121049
H  -1.01485 -6.106244 1.667891
H  -0.92737 -6.463751 -0.782705
elementType: Cl F O N C H
totalener: -2149.93663567 hartree
nucrepener: 2915.03120400 hartree
electener: -5064.96783967 hartree
oneelecener: -8743.58025273 hartree
twoeener: 3678.61241307 hartree
cpcmener: -0.03061041 hartree
kineticenergy: 2143.46892938 hartree
xcener: -159.159976481129 hartree
chargesum: 0.0000000
charge: -0.049480 -0.054987 -0.207297 -0.288044 -0.443785 -0.321508 -0.088585 0.133540 -0.031132 -0.154077 -0.279513 -0.272406 -0.218463 0.409271 0.077434 0.429704 -0.004650 -0.227084 -0.211231 -0.166867 0.213369 -0.153105 0.190021 0.287344 -0.202601 -0.242922 -0.136563 -0.121444 -0.181786 0.111868 0.115374 0.094953 0.100777 0.101779 0.094904 0.097031 0.101158 0.140095 0.124635 0.149912 0.149845 0.150891 0.158853 0.147341 0.159929 0.158592 0.158910
qa: -0.0495 -0.0550 -0.2073 -0.2880 -0.4438 -0.3215 -0.0886 0.1335 -0.0311 -0.1541 -0.2795 -0.2724 -0.2185 0.4093 0.0774 0.4297 -0.0047 -0.2271 -0.2112 -0.1669 0.2134 -0.1531 0.1900 0.2873 -0.2026 -0.2429 -0.1366 -0.1214 -0.1818 0.1119 0.1154 0.0950 0.1008 0.1018 0.0949 0.0970 0.1012 0.1401 0.1246 0.1499 0.1498 0.1509 0.1589 0.1473 0.1599 0.1586 0.1589
va: 1.2820 1.2511 1.0850 2.1290 2.0712 2.0899 3.1100 3.7142 3.8732 3.8351 3.9176 3.8963 3.9053 4.1658 4.1857 3.6697 3.7693 4.0829 3.9476 3.8999 3.7349 3.8831 4.0600 3.6871 3.9251 4.0122 3.8861 3.8829 3.9089 1.0236 1.0218 0.9985 1.0029 0.9997 1.0171 1.0014 0.9989 1.0086 1.0444 1.0146 0.9986 0.9983 0.9956 1.0070 0.9898 0.9891 0.9902
dispcorr: -0.023861065 hartree
energy: -2149.960496729690
dipole: 4.12997 -4.66026 -0.53029 -2.35024 2.99850 0.64826 20.95159 -18.87331 2.07828
magnitude: 2.24069 au
magnitude: 5.69539 debye
